program: Gaussian 09
title: 000154959
version: EM64L-G09RevD.01
frameworkgroup: C1[X(C21H18IN3O3S)]
method: RPBEPBE
basis: SDD
operation: Freq
keyword: #p
keyword: freq=noraman
keyword: PBEPBE/SDD
title: #p freq=noraman PBEPBE/SDD
converged: YES YES NO NO
title: Mulliken charges:
elementType: I S O O O N N N C C C C C C C C C C C C C C C C C C C C C H H H H H H H H H H H H H H H H H H
charge: 0.092401 0.972571 -0.318524 -0.540955 -0.548277 -0.482743 -0.027992 -0.484708 0.225754 0.232977 0.242419 -0.104072 -0.091137 0.267822 -0.221623 -0.384678 0.164301 0.276817 -0.276641 -0.296739 -0.306483 -0.408435 -0.386212 -0.417190 -0.256014 -0.176810 -0.231623 -0.763223 -0.530321 0.348675 0.289181 0.234986 0.272339 0.273429 0.268743 0.301312 0.231790 0.232741 0.255026 0.236461 0.267663 0.265089 0.296148 0.280176 0.232420 0.250382 0.242773
chargesum: 0.00000
title: Mulliken charges with hydrogens summed into heavy atoms:
elementType: I S O O O N N N C C C C C C C C C C C C C C C C C C C C C
charge: 0.092401 0.972571 -0.318524 -0.540955 -0.548277 -0.134068 -0.027992 -0.217044 0.225754 0.232977 0.242419 -0.104072 -0.091137 0.267822 0.067558 -0.149692 0.164301 0.276817 -0.004302 -0.023310 -0.037739 -0.107123 -0.154421 -0.417190 -0.023272 0.078217 0.004838 0.078190 0.195255
polarizability: 6.54151810e+02 -6.51603560e+01 3.94509558e+02 -1.01598655e+01 -2.12433577e+01 1.87971189e+02
1716.lowfreq: -8.6779 -5.1934 -2.8388 -0.0009 -0.0008 0.0002 8.6600 14.1297 16.7621
frequency: 7.3373 13.8212 16.5845 35.2390 37.5080 45.6961 50.5185 87.8360 97.5511 106.7537 113.1686 117.2274 136.0616 142.9945 148.8121 161.7915 167.9620 182.3731 201.2260 210.3114 239.0084 250.7328 259.5392 277.0647 291.1498 312.4038 316.0933 345.2791 367.8439 388.3937 397.5441 403.7775 424.1008 450.1736 455.7528 467.2614 478.3709 520.1095 527.1889 537.0300 540.2590 552.4480 576.3426 597.2580 610.1245 618.3340 633.1479 648.7220 674.3494 706.9705 717.3024 720.9245 739.1636 769.9215 785.4630 800.3955 802.5987 808.8717 831.9963 836.9647 853.5754 862.1461 868.7669 877.0205 886.5342 887.8828 926.5046 932.1827 936.5048 945.1311 967.3274 978.4912 996.9437 997.1072 1003.1447 1021.8252 1050.0487 1077.2816 1117.0094 1117.0547 1122.3860 1154.3906 1155.3230 1169.0209 1176.0117 1181.4274 1213.3645 1226.7824 1250.8545 1273.1609 1280.0872 1281.9386 1290.3146 1312.7594 1336.9542 1352.7893 1386.1304 1392.8901 1408.7021 1414.2557 1418.4110 1432.4395 1433.8933 1444.7574 1452.9289 1465.1590 1466.4955 1473.0871 1480.3436 1511.5708 1512.6418 1539.5170 1546.6146 1574.8802 1594.8661 1605.0627 1624.5519 2978.3467 3028.0727 3074.0861 3129.2778 3129.4386 3135.9198 3142.0149 3156.3728 3158.6185 3170.3446 3173.5526 3175.3603 3177.7317 3178.7927 3182.7319 3191.4772 3340.3746 3481.1393
redmass: 8.2859 5.6208 8.2310 5.9105 6.1052 5.0169 5.8406 5.6413 4.4072 4.0048 4.0126 7.5970 1.3466 4.0840 5.2694 5.5702 3.7694 3.1663 3.2256 2.7982 3.9265 4.3400 3.5875 4.2524 5.3158 5.1967 7.5762 6.6109 7.4102 4.0154 3.7641 4.4518 5.9695 4.5170 3.8421 5.2121 3.1046 3.9159 7.2247 7.0626 5.3703 4.5216 2.5737 2.4241 6.5405 4.7393 3.1860 4.3313 5.9164 5.8007 4.8694 4.0425 3.4509 1.5276 3.0627 1.5551 4.1543 4.3784 1.7280 1.5890 4.4358 1.6528 4.3136 1.6995 1.6958 2.1744 2.1673 1.9919 6.0189 1.3217 1.3590 1.3319 2.3075 1.5510 2.7413 2.1288 2.2612 4.8990 1.2980 1.8767 1.9006 1.3700 1.3670 1.2081 1.7882 1.2816 1.6646 1.7657 2.7357 1.7405 1.4523 1.5523 2.8360 2.5595 2.1196 2.6153 3.4765 3.8383 1.0586 1.0613 4.2274 2.5807 1.8477 3.3206 2.4793 1.1114 1.6320 2.4595 1.3677 6.2029 4.3395 6.3753 6.7851 4.1473 6.2395 6.5535 6.4379 1.0319 1.0239 1.1048 1.0857 1.0897 1.1017 1.0894 1.0878 1.0952 1.0945 1.0997 1.0945 1.1053 1.0983 1.1078 1.0922 1.0752 1.0744
irintensity: 1.7642 0.8012 2.4736 1.7564 2.8989 0.8149 1.1020 3.0119 10.2006 4.9123 32.9791 41.2276 2.6868 2.3982 12.1609 3.7458 0.4474 10.1999 2.5435 21.1701 0.6360 3.1306 3.6419 0.5538 9.0855 5.5409 12.7054 2.9397 38.1260 19.6497 29.6947 49.0364 1.8334 5.6364 1.7031 7.2907 1.3927 6.7787 3.1806 39.7323 20.4483 8.8814 36.2252 131.9214 10.6206 16.6914 33.3862 21.9699 11.4718 2.7939 16.8330 1.8984 1.8182 87.8340 1.1168 45.0542 48.5136 54.2624 45.8055 118.7181 12.1105 24.9021 3.0773 5.7527 7.0383 19.6847 4.3777 3.9407 8.9735 131.8331 1.0079 0.9142 30.9736 9.8418 68.1640 12.2270 12.8640 22.9704 8.6795 1.0743 98.6325 3.2395 4.7275 5.7358 58.1443 10.2825 14.4467 11.6665 12.3845 6.4764 31.6034 8.6023 22.1499 82.4784 28.3294 131.6628 52.0723 37.7188 6.0270 11.2174 67.0481 83.1655 24.2720 36.4237 4.0618 32.2265 107.3660 63.9179 98.5329 69.1817 404.4614 158.9024 15.2858 61.8243 16.6385 300.3826 28.9656 48.1624 0.6014 24.9159 0.3085 7.2120 16.1946 11.7839 0.1853 20.0113 7.5666 35.3533 0.7207 2.4411 7.1196 1.2305 1.1768 10.6082 69.5837
temp: 298.150 k
press: 1.00000 atm
elementType: 53 16 8 8 8 7 7 7 6 6 6 6 6 6 6 6 6 6 6 6 6 6 6 6 6 6 6 6 6 1 1 1 1 1 1 1 1 1 1 1 1 1 1 1 1 1 1
symmnumber: 1
zpe: 903324.4 jmol-1
zpe.correction: 0.344058 hartree
zpe.thermalcorrener: 0.371895 hartree
zpe.thermalcorrenthalpy: 0.372839 hartree
zpe.thermalcorrgfe: 0.280626 hartree
zpe.sumelectzpe: -1608.316155 hartree
zpe.sumelectthermal: -1608.288318 hartree
zpe.sumelectthermalent: -1608.287374 hartree
zpe.sumelectthermalfe: -1608.379587 hartree
dipole: 5.0556 -0.3999 0.3326
dipole: 5.0823
quadrupole: -234.5748 -173.3751 -188.4670
quadrupole: -29.0490 -1.9198 -12.1021
quadrupole: -35.7691 25.4305 10.3386 -29.0490 -1.9198 -12.1021
hfenergy: -1608.6602132 hartree
pointgroup: C01 [X(C21H18I1N3O3S1)]
dipole: 1.9225073 -0.4829164 0.2624996 debye
polarizability: 616.8326101|-114.7062158|382.238314|14.346448|-96.7871378|237.5616326 unknown
InChI: InChI=1S/C21H18IN3O3S/c1-28-20-12-14(25-29(2,26)27)8-10-19(20)24-21-15-5-3-4-6-17(15)23-18-9-7-13(22)11-16(18)21/h3-12,24-25H,1-2H3
charge 0 multiplicity 1
47 atoms
I  0.037836 4.652716 -1.427026
S  -5.83381 0.984906 -0.549407
O  -1.479791 -1.095422 2.430301
O  -7.268406 0.948398 -1.31702
O  -5.73555 0.929739 1.077074
N  0.547375 -0.676482 0.818037
N  4.441447 0.108758 -0.850643
N  -4.733614 -0.650863 -1.217789
C  1.806278 -0.401531 0.23771
C  2.080643 0.819579 -0.460973
C  2.867951 -1.347941 0.419603
C  3.417767 1.00225 -1.01729
C  4.182538 -1.027338 -0.127098
C  -0.722536 -0.625353 0.225936
C  1.130121 1.894161 -0.577212
C  2.691019 -2.607406 1.091653
C  -1.844596 -0.860434 1.094105
C  -3.39341 -0.616885 -0.783323
C  -0.968836 -0.416432 -1.156552
C  3.702318 2.207417 -1.752367
C  5.266062 -1.951532 0.07597
C  -3.153313 -0.869113 0.603905
C  -2.284617 -0.374005 -1.648706
C  1.466566 3.04668 -1.276501
C  3.763151 -3.480494 1.264878
C  2.752422 3.212922 -1.893515
C  5.066628 -3.144501 0.763954
C  -4.92813 2.612892 -1.07733
C  -2.562882 -1.324274 3.39773
H  0.537485 -1.061725 1.768601
H  0.152343 1.800607 -0.101377
H  1.696604 -2.898552 1.447249
H  -0.126907 -0.275924 -1.839528
H  4.704264 2.305702 -2.180426
H  6.240187 -1.673294 -0.3372
H  -4.015508 -1.056683 1.247257
H  -2.458069 -0.184268 -2.714949
H  3.611024 -4.438256 1.774068
H  2.982959 4.125516 -2.449895
H  5.898506 -3.841251 0.912813
H  -4.833668 -0.557638 -2.249606
H  -5.035668 2.691803 -2.167729
H  -5.456924 3.415639 -0.5447
H  -3.883015 2.515511 -0.752446
H  -3.124228 -2.243896 3.148032
H  -3.251772 -0.460291 3.422473
H  -2.062743 -1.439308 4.369958
