program: Gaussian 09
title: 000154957
version: EM64L-G09RevD.01
frameworkgroup: C1[X(C21H18FN3O3S)]
method: RPBEPBE
basis: SDD
operation: Freq
keyword: #p
keyword: freq=noraman
keyword: PBEPBE/SDD
title: #p freq=noraman PBEPBE/SDD
converged: YES YES NO NO
title: Mulliken charges:
elementType: S F O O O N N N C C C C C C C C C C C C C C C C C C C C C H H H H H H H H H H H H H H H H H H
charge: 0.936704 -0.194697 -0.317621 -0.543055 -0.560779 -0.483431 -0.026971 -0.476518 0.229105 0.271827 0.240122 -0.126644 -0.086818 0.283592 -0.502122 -0.384748 0.188308 0.271528 -0.290083 -0.269642 -0.307458 -0.433392 -0.339734 0.313653 -0.255499 -0.383039 -0.232002 -0.747983 -0.527617 0.349721 0.303883 0.235326 0.271709 0.272908 0.268294 0.251085 0.248380 0.231762 0.262997 0.236095 0.274301 0.270549 0.286135 0.276582 0.241881 0.226889 0.246518
chargesum: 0.00000
title: Mulliken charges with hydrogens summed into heavy atoms:
elementType: S F O O O N N N C C C C C C C C C C C C C C C C C C C C C
charge: 0.936704 -0.194697 -0.317621 -0.543055 -0.560779 -0.133710 -0.026971 -0.202217 0.229105 0.271827 0.240122 -0.126644 -0.086818 0.283592 -0.198239 -0.149422 0.188308 0.271528 -0.018374 0.003266 -0.039164 -0.182307 -0.091354 0.313653 -0.023737 -0.120042 0.004092 0.085283 0.187671
polarizability: 6.32144466e+02 4.90285681e+01 3.64694638e+02 1.49228945e+01 7.05189970e-01 1.77634446e+02
1716.lowfreq: -4.3758 -0.0017 -0.0011 -0.0003 1.2677 2.9832 5.6489 16.4675 19.1723
frequency: -1.2952 16.3826 19.1586 35.6180 41.1094 48.2095 66.9764 101.6478 104.1665 110.4551 119.0707 131.7744 136.8682 155.0123 163.1992 178.7883 200.3536 207.9640 224.6525 244.8481 254.6180 263.5839 283.3613 301.1924 311.3500 344.7480 366.1393 370.5455 377.2369 388.5691 403.1997 407.2498 451.4987 455.9198 466.7656 479.2938 519.4080 527.6571 536.0674 543.1117 563.9440 569.7894 583.8466 607.5351 623.3266 632.9455 645.6451 665.7122 711.3809 717.3699 722.7235 739.1741 757.1903 771.5448 788.5923 794.8142 815.4431 820.5784 831.1882 852.6702 868.0633 872.5627 873.2140 878.3669 881.4330 913.9414 930.3395 958.1928 966.9190 969.7328 969.8984 975.4745 996.6648 1002.3390 1011.5324 1021.8230 1067.0900 1107.9838 1117.8804 1119.5540 1139.7979 1151.8323 1165.7503 1166.8260 1171.5958 1183.8076 1214.5872 1231.5218 1253.2467 1269.8589 1286.7090 1299.2188 1300.0134 1309.7825 1344.3690 1351.9863 1387.3213 1401.4538 1414.7831 1417.3252 1423.4621 1435.3503 1440.0733 1445.0410 1458.1477 1467.1181 1470.6735 1478.6458 1483.8585 1518.2427 1527.7303 1551.7554 1555.3152 1576.3026 1607.5993 1613.1111 1635.7596 2972.8957 3035.3063 3067.3039 3129.5414 3134.0198 3141.9924 3153.8738 3156.3146 3158.0679 3163.2748 3172.9166 3177.7054 3182.4166 3183.1831 3185.2059 3191.7501 3308.0210 3478.5802
redmass: 6.4435 8.0031 5.9345 5.1022 6.1466 5.6520 7.5351 4.0053 4.0708 6.3808 5.6828 4.2921 5.6300 1.0932 5.4533 2.7568 5.9346 5.0678 1.8222 3.2503 4.8040 4.5932 4.2279 6.0400 6.5372 7.8894 7.7074 6.6728 6.8862 3.7600 3.8877 4.8473 3.7270 4.3562 5.8005 3.0238 6.9090 6.4937 3.8868 5.0482 5.1344 6.9635 2.8257 2.5886 4.4084 5.4952 2.2735 5.7543 4.9741 6.4245 3.5281 3.4789 6.2872 1.4823 2.9787 10.1394 1.9854 2.0905 1.8835 1.6962 3.6283 1.5994 4.0772 3.1596 2.3969 1.6742 2.4638 1.3423 1.3620 1.2976 1.3157 4.1294 1.3309 4.0514 1.7496 2.0986 3.5271 1.7298 1.6297 1.3603 1.4350 1.4682 1.6287 1.4681 1.9657 1.5109 1.4846 1.6692 3.1765 1.7349 3.2248 2.5268 1.1709 2.2071 2.1556 2.9792 3.7173 3.7237 1.0549 1.0554 4.8983 1.3675 3.0898 3.2088 3.4962 1.0495 1.6653 1.5071 2.5632 4.0147 6.7188 6.6896 7.3446 4.1523 6.2693 5.9532 6.9270 1.0323 1.0245 1.1046 1.0853 1.1008 1.0894 1.0910 1.0885 1.0953 1.0880 1.0998 1.0966 1.1072 1.0944 1.0966 1.1074 1.0748 1.0744
irintensity: 4.1498 0.1462 1.2148 2.8858 0.0773 0.8829 0.5143 4.3547 7.4013 1.6766 46.1746 7.4764 12.0149 0.8345 30.4867 1.5993 2.2058 3.9661 21.5835 0.8776 6.4424 1.5864 10.3858 1.8646 40.8052 14.4280 12.2821 9.7837 1.5530 6.4135 37.0120 39.5716 9.4605 3.5659 3.8151 1.1032 7.6147 11.3477 4.6501 4.9623 14.1798 55.2988 17.4171 142.0496 23.1500 0.7666 45.6443 2.1443 19.2799 9.9023 3.4663 1.3722 15.7325 66.9795 5.2268 106.1693 1.3921 40.1402 31.6614 29.6315 2.1017 27.8001 22.8677 65.0266 3.8537 43.3563 67.6698 1.4946 1.0350 51.2716 13.2742 7.5340 0.2657 50.1314 29.3121 11.0470 3.8161 29.7964 49.9479 17.7356 17.8228 11.5303 44.6372 19.6993 68.5939 57.0125 9.6705 16.6394 8.9298 1.5480 28.8850 96.4204 13.7244 98.3937 33.8224 61.6636 4.3101 125.7095 9.5715 8.6860 189.4410 4.0616 43.6495 25.6246 63.4543 14.6352 100.9089 9.2719 114.3693 467.7291 98.2256 8.9310 50.8182 19.0462 407.3379 30.6455 42.6588 53.3149 0.6762 29.2235 0.0121 15.7940 12.3639 3.5125 5.8375 19.7165 0.1166 34.0199 4.8125 0.4575 0.0288 10.1551 0.6916 5.9196 77.1809
temp: 298.150 k
press: 1.00000 atm
elementType: 16 9 8 8 8 7 7 7 6 6 6 6 6 6 6 6 6 6 6 6 6 6 6 6 6 6 6 6 6 1 1 1 1 1 1 1 1 1 1 1 1 1 1 1 1 1 1
symmnumber: 1
zpe: 910469.0 jmol-1
zpe.correction: 0.346779 hartree
zpe.thermalcorrener: 0.372781 hartree
zpe.thermalcorrenthalpy: 0.373725 hartree
zpe.thermalcorrgfe: 0.289117 hartree
zpe.sumelectzpe: -1696.653930 hartree
zpe.sumelectthermal: -1696.627928 hartree
zpe.sumelectthermalent: -1696.626984 hartree
zpe.sumelectthermalfe: -1696.711592 hartree
dipole: -4.0867 -3.8059 -1.6973
dipole: 5.8367
quadrupole: -202.2513 -148.1760 -177.2676
quadrupole: 7.4917 -10.8966 -15.3019
quadrupole: -26.3530 27.7223 -1.3693 7.4917 -10.8966 -15.3019
hfenergy: -1697.0007091 hartree
pointgroup: C01 [X(C21H18F1N3O3S1)]
dipole: -1.2795745 1.906466 -0.0350132 debye
polarizability: 603.0519968|-103.8281475|357.1486843|-14.5108864|-71.7472185|214.2728691 unknown
InChI: InChI=1S/C20H15FN3O.CH3O2S/c1-25-19-11-13(22)7-9-18(19)24-20-14-4-2-3-5-16(14)23-17-8-6-12(21)10-15(17)20;1-4(2)3/h2-11,22,24H,1H3;1H3
charge 0 multiplicity 1
47 atoms
S  5.728648 -1.419869 0.037686
F  -0.516404 -4.32334 0.468153
O  1.266468 1.430909 -2.7839
O  4.690609 -2.336473 -0.836705
O  7.242956 -1.117201 -0.512976
N  -0.58278 0.699773 -1.08551
N  -4.323233 -0.258866 0.823303
N  4.823112 0.457227 0.581378
C  -1.787467 0.360414 -0.421666
C  -2.023511 -0.942401 0.123045
C  -2.832389 1.339629 -0.368097
C  -3.314936 -1.183165 0.76795
C  -4.100249 0.96586 0.249611
C  0.732745 0.596677 -0.623718
C  -1.092065 -2.032396 0.011608
C  -2.682313 2.678589 -0.87292
C  1.765397 0.999845 -1.541553
C  3.488741 0.520074 0.135971
C  1.110673 0.17722 0.680285
C  -3.576956 -2.476019 1.349722
C  -5.171036 1.926061 0.28321
C  3.113998 0.952277 -1.178611
C  2.463588 0.130116 1.04639
C  -1.421792 -3.251386 0.577674
C  -3.740471 3.583617 -0.818981
C  -2.646808 -3.503889 1.267871
C  -5.00146 3.201222 -0.246916
C  5.887343 -2.225346 1.758841
C  2.23667 1.812888 -3.815397
H  -0.663542 1.198058 -1.978542
H  -0.142366 -1.920131 -0.515876
H  -1.717415 3.001401 -1.279008
H  0.339078 -0.095582 1.404601
H  -4.54419 -2.61146 1.841355
H  -6.110538 1.606969 0.744291
H  3.897921 1.225769 -1.892485
H  2.756918 -0.176535 2.055204
H  -3.608825 4.601274 -1.202317
H  -2.829763 -4.493693 1.695506
H  -5.822658 3.925357 -0.217005
H  5.461723 1.010441 -0.031134
H  4.864485 -2.345882 2.139368
H  6.389391 -3.189091 1.594542
H  6.483624 -1.532183 2.365937
H  2.895714 0.961047 -4.06617
H  2.844305 2.677023 -3.48566
H  1.63486 2.091372 -4.69225
