program: Gaussian 09
title: 000154929
version: EM64L-G09RevD.01
frameworkgroup: C1[X(C5H8N3O4)]
method: RPBEPBE
basis: SDD
operation: Freq
keyword: #p
keyword: freq=noraman
keyword: PBEPBE/SDD
title: #p freq=noraman PBEPBE/SDD
converged: YES YES NO NO
title: Mulliken charges:
elementType: O O O O N N N C C C C C H H H H H H H H
charge: -0.203435 -0.373186 -0.267255 -0.354973 -0.572886 0.064817 0.119112 -0.174875 -0.304996 0.194628 0.463631 -0.267069 0.297100 0.272241 0.291009 0.313215 0.334555 0.406668 0.335928 0.425773
chargesum: 1.00000
title: Mulliken charges with hydrogens summed into heavy atoms:
elementType: O O O O N N N C C C C C
charge: -0.203435 0.033482 -0.267255 0.070800 0.074884 0.064817 0.119112 0.122224 0.258254 0.194628 0.463631 0.068858
polarizability: 1.97797136e+02 2.81445770e+01 7.28350819e+01 5.88751699e+00 1.04591646e+00 6.52307162e+01
1716.lowfreq: -10.6427 -4.5470 0.0006 0.0009 0.0009 6.5866 28.9726 41.4489 63.7205
frequency: 28.7058 41.4156 63.7197 96.7538 110.5874 143.9079 202.5574 217.4818 262.3347 275.5101 300.3243 320.7559 360.0602 416.8390 475.8886 485.5749 501.9025 509.8658 545.0007 570.3548 623.6110 660.8011 692.7555 702.6215 769.2977 775.3645 893.8705 970.9134 1034.6904 1056.1922 1087.5485 1141.0411 1146.2625 1162.4013 1212.8237 1271.5427 1293.1870 1320.7935 1331.9046 1361.5670 1428.1113 1463.7891 1526.6104 1616.2149 1650.9793 2072.4688 3035.3195 3081.3793 3177.7687 3193.8435 3511.3718 3532.3958 3574.6422 3664.5480
redmass: 6.7574 9.7894 5.3057 3.7690 4.9564 5.1298 4.7550 1.6315 3.5965 3.4186 2.4613 2.9069 1.6522 6.1949 2.8560 5.4976 4.1672 1.7625 3.8240 3.0777 1.3120 4.5211 3.1412 2.1913 3.3456 7.6573 5.6961 1.4940 3.4000 1.3409 1.8574 2.6204 2.4798 2.2093 1.1849 1.4391 1.7351 1.4732 1.4690 1.6923 1.6592 1.9036 5.4663 8.0591 1.1129 13.3840 1.0843 1.0583 1.1122 1.0908 1.0647 1.0461 1.0680 1.1022
irintensity: 0.8451 2.9973 1.2589 14.9501 20.3272 9.6301 4.9645 53.7322 7.5217 8.5562 41.8550 15.1552 109.0873 5.8833 28.9469 65.3915 45.8901 334.0601 1.1419 3.3517 117.5076 4.5804 35.6016 77.8782 25.7324 49.5551 56.5920 25.5527 173.0770 207.7091 122.3552 12.6051 18.7765 6.6614 21.8909 27.6701 32.5082 19.4339 24.3868 16.4430 75.6956 26.2485 590.5645 173.3899 69.9645 520.6181 1.9757 3.1736 0.2559 43.7348 70.9762 96.5597 108.4739 41.4753
temp: 298.150 k
press: 1.00000 atm
elementType: 8 8 8 8 7 7 7 6 6 6 6 6 1 1 1 1 1 1 1 1
symmnumber: 1
zpe: 376633.3 jmol-1
zpe.correction: 0.143452 hartree
zpe.thermalcorrener: 0.156706 hartree
zpe.thermalcorrenthalpy: 0.157650 hartree
zpe.thermalcorrgfe: 0.102559 hartree
zpe.sumelectzpe: -659.235533 hartree
zpe.sumelectthermal: -659.222279 hartree
zpe.sumelectthermalent: -659.221335 hartree
zpe.sumelectthermalfe: -659.276426 hartree
dipole: 2.1687 0.2749 0.1095
dipole: 2.1888
quadrupole: -27.7280 -59.4372 -57.1633
quadrupole: 0.2429 -0.8449 0.0543
quadrupole: 20.3815 -11.3277 -9.0538 0.2429 -0.8449 0.0543
hfenergy: -659.3789852 hartree
pointgroup: C01 [X(C5H8N3O4)]
dipole: 0.8239022 0.2072529 0.1406542 debye
dipolederiv: -1.2672793 -0.3557051 -0.2127052 -0.4032614 -0.5652743 -0.1512434 -0.4504627 -0.2526998 -0.5095222 -0.9568644 0.4576314 0.0517298 0.671346 -0.6768746 0.0567739 0.1422445 -0.0188703 -0.3370524 -0.9822464 0.1653655 -0.1464998 0.0265338 -0.4973463 -0.1486855 -0.1981679 -0.1242148 -0.436477 -0.4098062 0.1605616 -0.074802 0.0834831 -0.4341567 0.3134172 -0.0489714 0.3922224 -0.9310979 -0.8765731 -0.0746579 0.0216602 -0.3086892 -0.8759029 -0.1632283 0.0405138 -0.096047 -0.2550764 1.7568485 0.6143834 0.399185 0.4451306 0.3223745 0.2295835 1.1413612 0.5487534 0.299916 -1.0013792 -0.4142669 -0.1600287 -0.3340743 -0.0885688 -0.0578086 -0.7537154 -0.2928205 -0.0756041 0.7616236 0.1347856 -0.0607761 -0.2601614 0.2006855 -0.0715978 0.0230017 -0.0660964 0.139587 0.7585008 0.1579387 0.0181375 0.590855 0.4025048 0.0769437 -0.1981986 -0.0643775 0.1849789 1.4322978 -0.4723092 0.2637546 -0.5090546 0.8167057 0.273638 0.1342235 0.2931366 0.4484063 1.6070228 0.5070332 0.2200928 0.7338079 1.1356385 -0.1141051 0.3774797 -0.1606269 1.2316115 -1.1127557 -0.4581717 -0.1466437 -0.5827245 -0.472855 -0.154095 -0.185016 -0.1493719 -0.1535414 0.0894918 0.0005659 -0.0077234 -0.0041812 0.0368974 0.0251983 -0.0052568 0.045771 0.0038218 -0.0056563 -0.0172007 -0.0278787 -0.0277089 0.1102783 0.0034288 0.0067304 0.0634838 0.010324 0.0211946 -0.0119738 0.0063219 -0.0165802 0.0529 -0.0414695 0.0530001 -0.0543149 0.0723175 0.1831798 -0.0619449 -0.0183655 0.0420573 0.3879295 -0.0200372 -0.0976832 -0.0196906 0.1131952 0.2034215 -0.0163143 -0.0107743 0.1634818 0.3587736 0.1023163 0.1460989 0.1086441 0.2151166 0.3259408 -0.0917219 -0.0853368 -0.1099261 0.299662 -0.0913115 -0.0708886 -0.0911568 0.3147024 0.1630209 -0.0680657 -0.0204573 -0.0548476 0.1980761 0.0090594 -0.0405668 0.0045939 0.221621 0.3100179 -0.1559332 -0.0088901 -0.1454861 0.2885526 -0.0767772 -0.0157262 -0.0663178 0.4427729 unknown
polarizability: 185.5399611|40.8458674|80.8117677|23.2103678|8.3009582|69.5112055 unknown
InChI: InChI=1S/C5H8N3O4/c6-3(5(10)11)2-12-4(9)1-8-7/h1,3,9-10H,2,6H2
charge 1 multiplicity 1
20 atoms
O  0.517062 -0.848866 -0.964394
O  -2.914855 1.445718 0.222718
O  -0.716569 0.985303 0.809616
O  1.424674 -1.023549 1.126925
N  -3.147608 -1.388534 -0.311539
N  3.42014 0.899939 0.158255
N  4.363544 1.262784 0.748851
C  -1.975526 -0.6011 -0.645379
C  -0.764377 -1.560444 -0.517761
C  -1.774636 0.674734 0.204614
C  1.420255 -0.434709 -0.090379
C  2.359646 0.520327 -0.566712
H  -2.059054 -0.268707 -1.696828
H  -0.62485 -1.933123 0.508686
H  -0.866379 -2.385358 -1.234478
H  -3.380896 -1.516837 0.673133
H  -3.947906 -1.338186 -0.939416
H  -2.793662 2.273048 0.764656
H  2.241898 0.968555 -1.554567
H  1.898498 -0.555895 1.8608
