program: Gaussian 09
title: 000158101
version: EM64L-G09RevD.01
frameworkgroup: C1[X(C16H26O8)]
method: RPBEPBE
basis: SDD
operation: Freq
keyword: #pfreq=noraman
keyword: PBEPBE/SDD
title: #p freq=noraman PBEPBE/SDD
converged: NO YES NO NO
title: Mulliken charges:
elementType: O O O O O O O O C C C C C C C C C C C C C C C C H H H H H H H H H H H H H H H H H H H H H H H H H H
charge: -0.262109 -0.232731 -0.232053 -0.515974 -0.473097 -0.455843 -0.444144 -0.441849 -0.266815 -0.131278 -0.012504 -0.448838 -0.455867 -0.060623 0.283119 -0.007669 -0.290003 -0.795512 -0.186297 -0.211149 -0.103809 -0.108123 -0.781247 -0.148411 0.261831 0.231587 0.206359 0.208143 0.227997 0.231956 0.207542 0.231653 0.217730 0.227179 0.242404 0.217775 0.205511 0.279825 0.255423 0.291864 0.245302 0.264465 0.249674 0.222193 0.217668 0.375860 0.368057 0.352535 0.386914 0.355380
chargesum: 0.00000
title: Mulliken charges with hydrogens summed into heavy atoms:
elementType: O O O O O O O O C C C C C C C C C C C C C C C C
charge: -0.262109 -0.232731 -0.232053 -0.140114 -0.105039 -0.103308 -0.057231 -0.086468 -0.004985 0.100309 0.193854 -0.012698 -0.016370 0.171030 0.283119 0.210061 -0.062824 -0.129821 0.093528 0.044273 0.188055 0.137179 -0.044916 0.069257
polarizability: 2.03309158e+02 9.89875944e+00 1.95652543e+02 8.70237012e-01 -2.58943990e+00 1.71754591e+02
1716.lowfreq: -12.7454 -8.4754 -0.0004 0.0003 0.0004 5.1412 12.0043 39.0724 57.1029
frequency: 6.2123 38.9348 56.6639 65.1416 83.4493 88.7007 105.1390 111.5327 128.5689 148.6010 164.3118 187.0659 201.2747 211.4320 224.3434 233.8848 240.1339 251.6717 253.5872 266.2236 279.3648 290.8393 295.2630 315.4443 337.9554 344.7033 358.6865 399.9086 415.6648 419.5542 430.2231 436.0945 457.7710 475.4686 486.3327 508.9146 524.6862 540.0141 548.9056 568.6776 588.8320 608.1426 623.1907 644.1470 681.8200 712.4252 740.2296 775.1608 787.3335 805.1293 838.7784 845.4297 861.2256 885.9383 890.8553 898.4810 908.2253 918.1787 928.8452 950.0107 952.6826 955.9505 966.6517 984.2064 988.6192 995.7283 998.6415 1015.4223 1019.8415 1041.8403 1054.1011 1057.3182 1070.2262 1077.3544 1090.1459 1110.3789 1119.4749 1136.9335 1167.2421 1169.6614 1176.5406 1205.0520 1206.5080 1213.1881 1218.8268 1228.9896 1240.5113 1254.4075 1263.0997 1274.3334 1277.0789 1285.7131 1294.8602 1302.0170 1303.6078 1304.7779 1312.5096 1318.9449 1329.8065 1330.8083 1336.4772 1338.8122 1363.1780 1367.3402 1369.7535 1373.2221 1383.7311 1384.5911 1391.1406 1400.4276 1447.1698 1462.6010 1471.8397 1472.3978 1480.5244 1485.4526 1489.5756 1649.7701 2954.9479 2961.4348 2968.1774 2992.9090 2995.5506 2996.0940 3002.2053 3006.0162 3012.2887 3015.1166 3016.2190 3019.1130 3027.0888 3050.6912 3058.1074 3072.5792 3078.0916 3089.2410 3113.1643 3145.6855 3212.8599 3329.5098 3552.4290 3554.7489 3557.2699 3582.4577
redmass: 4.7630 5.3931 4.4917 5.4214 5.3707 3.8083 2.4168 3.0002 4.8686 5.2289 4.2736 4.0436 3.0223 1.5521 1.6522 1.8453 1.6113 1.5704 2.6486 3.5023 2.7810 2.8802 2.9249 4.8304 2.3115 3.1975 3.9728 1.9901 2.7882 2.0769 3.7343 1.6576 3.2770 3.7049 3.3935 3.9630 4.5518 4.4789 4.4731 5.1994 3.8668 1.1489 5.1938 3.6137 3.2583 4.1709 1.4491 3.3944 2.6603 3.1996 3.1313 2.3367 3.6314 3.9835 3.0797 1.7119 2.2753 3.3600 2.2644 4.1514 3.3581 1.9484 3.5346 2.3659 4.2466 3.5294 2.4726 2.9744 2.7126 2.3172 1.8919 2.4169 2.4621 2.7952 1.8610 1.9931 1.9823 2.2192 1.7730 2.0994 1.5951 1.3596 1.4354 1.2244 1.2800 1.3766 1.2837 1.2151 1.4813 1.2500 1.2877 1.4757 1.2235 1.3212 1.2651 1.2587 1.3166 1.2324 1.3935 1.4316 1.6894 1.5607 1.3747 1.4395 1.3723 1.3366 1.2250 1.3479 1.4389 1.3236 1.3382 1.0756 1.0487 1.0578 1.0898 1.0602 1.0530 6.7608 1.0830 1.0833 1.0366 1.0738 1.0456 1.0590 1.0817 1.0844 1.0660 1.0846 1.0871 1.0852 1.0850 1.1036 1.0985 1.1013 1.1031 1.0970 1.1009 1.0885 1.0994 1.0671 1.0652 1.0659 1.0653 1.0668
irintensity: 0.2139 0.3496 0.1921 0.0528 0.1963 0.9718 1.3731 3.3238 2.5911 1.0476 10.2007 4.0213 2.5178 5.9279 37.7578 24.4478 26.8131 47.6614 31.5048 30.7063 25.5585 5.4466 14.3500 11.2565 53.0497 10.4996 10.0823 24.0477 19.5292 52.7801 27.5311 150.0049 28.7933 12.2506 3.6663 19.9677 15.3126 6.7214 6.6693 12.8445 2.3352 216.7925 22.0004 20.1540 8.8457 9.8239 45.2535 8.5323 6.7435 9.6194 18.8690 15.1153 135.5287 26.8366 96.8049 2.4814 26.7048 222.7258 47.0534 42.8240 151.2311 8.5861 39.2581 78.0111 176.5319 37.4773 16.0886 22.0653 10.3560 57.0321 5.7049 47.8492 29.3004 42.4649 61.4887 6.4522 54.7818 2.3430 66.3657 14.5455 6.7390 12.1411 20.9611 37.5652 20.3049 0.1845 2.7926 3.2157 16.0890 20.3228 9.3535 1.3857 3.7263 3.6371 0.5890 12.5771 7.2895 15.8324 21.7184 9.1856 29.9686 20.2944 3.4311 3.1162 3.3267 6.2844 10.3198 18.9753 7.1376 7.6938 91.6925 5.0616 5.3222 17.4818 6.0015 9.5080 7.0987 33.7910 12.7747 38.3354 37.5205 8.3995 2.9510 33.4568 24.8545 27.4380 74.1664 48.5890 19.4396 40.8542 43.2675 2.4483 34.1837 5.5830 106.4092 15.2524 2.7334 9.7699 8.0556 159.4607 7.4280 20.8344 24.9860 12.0929
temp: 298.150 k
press: 1.00000 atm
elementType: 8 8 8 8 8 8 8 8 6 6 6 6 6 6 6 6 6 6 6 6 6 6 6 6 1 1 1 1 1 1 1 1 1 1 1 1 1 1 1 1 1 1 1 1 1 1 1 1 1 1
symmnumber: 1
zpe: 1081063.6 jmol-1
zpe.correction: 0.411755 hartree
zpe.thermalcorrener: 0.436280 hartree
zpe.thermalcorrenthalpy: 0.437224 hartree
zpe.thermalcorrgfe: 0.358136 hartree
zpe.sumelectzpe: -1225.123427 hartree
zpe.sumelectthermal: -1225.098903 hartree
zpe.sumelectthermalent: -1225.097959 hartree
zpe.sumelectthermalfe: -1225.177046 hartree
dipole: 1.9033 3.6496 -1.0519
dipole: 4.2483
quadrupole: -144.4029 -136.9725 -138.1051
quadrupole: -0.7013 1.7957 -8.5700
quadrupole: -4.5761 2.8543 1.7217 -0.7013 1.7957 -8.5700
hfenergy: -1225.5351823 hartree
pointgroup: C01 [X(C16H26O8)]
dipole: -0.5129704 1.5635971 0.2927393 debye
polarizability: 200.2718991|-10.4331133|199.0166771|1.2674127|0.3326327|171.427716 unknown
InChI: InChI=1S/C16H26O8/c1-7-3-4-8-5-6-22-14(9(7)8)24-15-10(17)11(18)16(2,21)12(23-15)13(19)20/h5-15,17-21H,3-4H2,1-2H3
charge 0 multiplicity 1
50 atoms
O  -0.850709 0.453783 0.56749
O  -1.701207 -1.445786 1.779976
O  1.236851 -0.413801 1.485656
O  2.831543 -0.19763 -1.877622
O  2.364427 2.587699 -1.240969
O  0.234456 3.103852 0.522363
O  3.611775 -2.380557 -0.533634
O  1.564788 -3.251679 0.349793
C  -3.213592 -0.157157 0.297633
C  -2.960938 -1.143599 -0.880564
C  -3.593113 1.176196 -0.410074
C  -2.325951 -0.270218 -2.020165
C  -2.720908 1.209164 -1.705634
C  -2.015081 -0.113226 1.260343
C  2.555291 0.283574 -0.494043
C  0.308255 0.719388 1.394707
C  -2.151615 -2.348663 -0.454389
C  -3.488576 2.454962 0.444266
C  1.609734 1.502427 -0.608859
C  1.068948 1.917397 0.76733
C  1.738401 -0.865285 0.16411
C  -1.602798 -2.452614 0.78151
C  3.870986 0.61535 0.234612
C  2.539913 -2.160647 0.415603
H  -4.05348 -0.517196 0.923933
H  -3.955447 -1.488636 -1.232569
H  -4.654036 1.053255 -0.715896
H  -2.682294 -0.600609 -3.012995
H  -1.228658 -0.388744 -2.005907
H  -1.815541 1.812142 -1.515581
H  -3.270965 1.68299 -2.539754
H  -2.220435 0.480774 2.171873
H  0.013276 0.899235 2.447238
H  -1.988909 -3.166139 -1.16426
H  -2.434003 2.660567 0.702539
H  -3.867686 3.327664 -0.119342
H  -4.081322 2.378578 1.376489
H  0.748861 1.220186 -1.248889
H  1.909275 2.17449 1.442751
H  0.883361 -1.112866 -0.494347
H  -0.9891 -3.283056 1.132897
H  4.594797 -0.201469 0.08264
H  4.288785 1.561972 -0.147147
H  3.699819 0.718624 1.321477
H  3.019147 -2.138476 1.412768
H  3.190714 0.565314 -2.399304
H  1.778622 3.387886 -1.239111
H  0.073981 3.58566 1.371357
H  3.428982 -1.859932 -1.372244
H  2.076775 -4.100344 0.393644
