program: Gaussian 09
title: 000154919
version: EM64L-G09RevD.01
frameworkgroup: C1[X(C12H7NO2)]
method: RPBEPBE
basis: SDD
operation: Freq
keyword: #p
keyword: freq=noraman
keyword: PBEPBE/SDD
title: #p freq=noraman PBEPBE/SDD
converged: YES YES YES YES
title: Mulliken charges:
elementType: O O N C C C C C C C C C C C C H H H H H H H
charge: -0.210058 -0.214621 0.020250 -0.254021 0.413194 0.343907 0.400742 0.254253 -0.406437 -0.395478 -0.415729 -0.369413 -0.410198 -0.407767 -0.208702 0.263026 0.259666 0.260782 0.302615 0.255628 0.285798 0.232563
chargesum: 0.00000
title: Mulliken charges with hydrogens summed into heavy atoms:
elementType: O O N C C C C C C C C C C C C
charge: -0.210058 -0.214621 0.020250 -0.254021 0.413194 0.343907 0.400742 0.254253 -0.143411 -0.135812 -0.154946 -0.066799 -0.154570 -0.121968 0.023861
polarizability: 2.15839174e+02 5.13611523e+00 1.86259110e+02 2.67280096e-03 1.16639428e-03 5.27084983e+01
1716.lowfreq: -8.7963 -5.4071 -0.0007 -0.0003 0.0005 5.0955 28.0516 89.1167 172.8013
frequency: 28.0448 89.1159 172.8012 209.6083 216.0692 277.4601 329.5279 369.1225 382.1718 452.5931 460.0778 528.5671 552.4944 558.4227 568.8226 612.1542 667.8903 668.2355 701.9831 702.1583 743.5165 773.4352 789.0180 807.0353 830.4059 877.6845 900.4243 930.3577 945.2668 990.0853 1001.5609 1018.0408 1038.7429 1089.5022 1099.7350 1129.8654 1183.1645 1192.8300 1203.3008 1209.5587 1253.4835 1318.2332 1339.2177 1362.4640 1397.2651 1408.7012 1456.4948 1465.8703 1476.7291 1492.5111 1599.8093 1608.1651 1624.5865 3136.4199 3151.6152 3156.5721 3180.0024 3182.2346 3208.6550 3209.1134
redmass: 13.4016 6.2107 4.1739 3.9325 8.7540 4.8124 9.7848 8.7851 4.2226 3.2055 4.3987 7.8051 5.2674 3.5364 7.2117 4.3992 3.2402 6.3045 8.6017 6.8574 1.9274 7.1592 1.4311 5.6098 2.1770 1.4412 5.4324 1.3423 1.4470 1.3761 1.3524 3.0733 2.0488 1.2216 3.2157 2.2531 1.5123 2.5572 1.7616 2.2801 2.1939 2.4864 3.7517 3.4592 2.8179 3.1330 4.2815 6.6327 4.4953 4.9235 8.1248 7.7516 7.4942 1.0887 1.0910 1.0952 1.0934 1.0891 1.1048 1.0945
irintensity: 0.0153 1.7529 7.7627 1.7117 2.3999 6.3296 0.1332 1.1887 0.1713 0.0148 1.5502 1.5958 6.4219 0.0178 0.1098 0.0440 0.1495 0.0166 5.3991 11.1397 37.7705 14.0771 13.0018 14.0473 54.6523 70.1565 10.7854 1.0550 0.9689 0.4237 1.7716 2.1632 1.3995 9.2948 1.5615 3.5545 72.9057 244.8914 67.9978 82.2905 23.8079 0.2523 84.1590 20.4891 24.0388 3.8683 4.4599 15.2943 83.8455 19.0442 9.4641 4.6395 5.4619 6.6266 8.6391 20.7006 2.0542 0.4214 11.7787 7.8677
temp: 298.150 k
press: 1.00000 atm
elementType: 8 8 7 6 6 6 6 6 6 6 6 6 6 6 6 1 1 1 1 1 1 1
symmnumber: 1
zpe: 414679.5 jmol-1
zpe.correction: 0.157943 hartree
zpe.thermalcorrener: 0.168489 hartree
zpe.thermalcorrenthalpy: 0.169433 hartree
zpe.thermalcorrgfe: 0.120768 hartree
zpe.sumelectzpe: -665.581069 hartree
zpe.sumelectthermal: -665.570523 hartree
zpe.sumelectthermalent: -665.569579 hartree
zpe.sumelectthermalfe: -665.618243 hartree
dipole: 5.4148 -1.0103 0.0003
dipole: 5.5083
quadrupole: -93.6954 -71.8021 -88.8288
quadrupole: 3.9401 -0.0017 -0.0008
quadrupole: -8.9199 12.9733 -4.0534 3.9401 -0.0017 -0.0008
hfenergy: -665.7390119 hartree
pointgroup: C01 [X(C12H7N1O2)]
dipole: 2.137897 -0.3546759 0.0001338 debye
dipolederiv: -1.0328977 -0.196548 -0.0000565 -0.2947771 -0.5017181 -0.0000397 -0.0001911 -0.0001047 -0.2319045 -0.6401966 0.1202294 -0.0000043 0.2883676 -0.7352481 -0.0001261 -0.0000383 -0.0000073 -0.231107 2.0704223 -0.0729048 0.0001068 -0.2736144 1.0430707 0.0001751 0.0001837 0.0001341 0.1901626 -0.3334418 0.322918 -0.0000025 0.4671983 -0.1701695 0.0000014 0.0000042 -0.0000125 -0.0755749 0.4182423 0.2368735 0.0000026 -0.1189848 0.0247081 0.0000037 -0.0000057 0.0000008 0.0768461 0.1828284 -0.16209 0.0000038 0.053602 -0.1233333 0.0000062 0.0000642 -0.0000124 0.0772296 -0.2847019 -0.1303867 -0.000003 0.2420308 -0.157432 0.0000029 -0.0000107 0.0000088 0.0426054 -0.7094707 0.2708373 -0.0000377 0.5126564 0.1367546 -0.0000151 -0.0000063 -0.000011 0.030437 -0.0212374 -0.2199368 -0.0000014 -0.0842875 -0.1017121 -0.0000031 0.0000086 0.0000019 -0.2164373 0.144207 -0.0460269 -0.000003 -0.2283205 0.1908604 -0.0000032 -0.0000032 0.0000025 -0.1740935 -0.4192092 -0.3020447 -0.0000038 -0.0886872 0.2153842 -0.0000027 -0.0000035 0.0000051 -0.1473832 0.090072 -0.0275398 -0.0000054 0.1273346 0.0896352 -0.0000035 -0.0000168 0.0000002 -0.1387477 0.3286869 0.1506742 -0.0000045 -0.1374788 0.0010625 -0.0000023 0.0000019 -0.0000058 -0.1277847 0.3006441 0.1708033 -0.0000033 -0.4118396 -0.2499538 -0.0000086 0.0000018 0.0000103 -0.0904073 -0.3316796 -0.1367884 0. -0.0420745 0.2175882 -0.0000015 0.0000003 0.0000025 -0.1428416 0.038816 0.0486543 0. 0.0995491 -0.0263651 0.0000022 0.0000004 -0.0000019 0.1842148 -0.069004 0.011263 0.0000025 -0.0408346 0.0906294 0.0000011 0.0000014 -0.0000006 0.1767647 0.0786045 0.0217098 -0.0000017 0.0223086 -0.0751591 0.0000025 -0.0000059 0.0000009 0.1563032 0.0828193 0.0877397 0.0000029 0.0168583 0.1021653 0.0000029 0.0000035 -0.0000024 0.1662667 -0.0478228 -0.092152 0.0000025 -0.0740579 0.0480006 0.0000018 0.0000029 0.0000021 0.155504 0.0677933 -0.0583986 0.0000056 -0.0281162 0.1023551 0.0000043 0.0000096 -0.0000106 0.1642874 0.0865259 0.0031145 0.0000004 -0.0068327 -0.1211233 0.0000019 -0.0000011 0. 0.1556605 unknown
polarizability: 215.6213762|5.7249213|186.4769083|0.0026489|0.0012197|52.7084983 unknown
InChI: InChI=1S/C12H7NO2/c14-13(15)11-7-6-9-5-4-8-2-1-3-10(11)12(8)9/h1-7H
charge 0 multiplicity 1
22 atoms
O  -3.819778 -0.806929 -0.000328
O  -3.113985 1.353307 0.00007
N  -2.878311 0.080936 0.000037
C  0.913769 -0.107278 0.000022
C  1.137241 -1.526635 0.000028
C  -0.348172 0.534999 0.000032
C  2.174554 0.568594 0.000007
C  -1.469616 -0.38331 0.000033
C  2.601352 -1.729857 0.000029
C  3.21813 -0.486666 -0.000003
C  0.021042 -2.372502 0.000034
C  -0.315655 1.981152 0.000021
C  2.182484 1.965784 -0.000002
C  -1.278141 -1.779965 0.000029
C  0.917526 2.651194 0.0000
H  3.099533 -2.70057 0.000038
H  4.294096 -0.300613 -0.000018
H  0.114968 -3.463154 0.000042
H  -1.249477 2.543618 0.000036
H  3.114439 2.541722 -0.000019
H  -2.171267 -2.410994 0.000023
H  0.915169 3.746766 -0.00001
