program: Gaussian 09
title: 000154917
version: EM64L-G09RevD.01
frameworkgroup: C1[X(C10H13NO)]
method: RPBEPBE
basis: SDD
operation: Freq
keyword: #p
keyword: freq=noraman
keyword: PBEPBE/SDD
title: #p freq=noraman PBEPBE/SDD
converged: YES YES NO NO
title: Mulliken charges:
elementType: O N C C C C C C C C C C H H H H H H H H H H H H H
charge: -0.277228 -0.375441 -0.519087 0.484171 -0.499513 0.276179 -0.442562 -0.369218 -0.665688 -0.217163 -0.224571 -0.241187 0.224568 0.267015 0.297549 0.234761 0.202124 0.231370 0.247436 0.253955 0.213372 0.215755 0.226738 0.226972 0.229692
chargesum: 0.00000
title: Mulliken charges with hydrogens summed into heavy atoms:
elementType: O N C C C C C C C C C C
charge: -0.277228 -0.077892 -0.027505 0.484171 -0.062628 0.276179 -0.211192 -0.121782 0.017395 0.009575 0.002401 -0.011495
polarizability: 1.59752587e+02 -2.63239082e+00 1.08185090e+02 -1.13905365e+01 4.57956065e+00 7.71949116e+01
1716.lowfreq: -13.7693 -11.3766 -0.0001 0.0003 0.0007 7.0366 14.2331 24.1408 43.0387
frequency: 11.1928 23.8059 42.8925 60.6250 170.6880 195.0089 226.7330 251.9780 293.6080 319.0676 402.9337 436.7156 497.7149 550.4878 591.7036 605.8363 617.5943 679.6002 704.7200 753.4624 793.8962 803.0063 852.9451 855.0289 916.2915 975.2576 977.3835 990.0100 995.5352 1021.8630 1026.1414 1041.8522 1077.2956 1086.0577 1101.7886 1172.2280 1186.4655 1204.8569 1214.0173 1230.7630 1265.1387 1314.7907 1333.7475 1354.2518 1386.3726 1387.3083 1441.4778 1449.5768 1469.9932 1472.3703 1479.9472 1486.4276 1488.2539 1595.3790 1614.3886 1618.1055 2981.9672 2983.3733 2993.0176 3036.0549 3041.6572 3088.2132 3104.7986 3114.8403 3123.9120 3135.8395 3146.8452 3163.8071 3550.8910
redmass: 2.8476 3.7053 4.5765 3.4951 4.0938 1.4489 2.1896 3.2237 3.9250 2.5056 2.8004 2.7649 3.7249 2.2821 2.6311 1.7974 5.9107 3.2553 1.8087 1.8313 1.3976 3.2392 1.7770 1.7094 1.3985 2.1195 1.4855 6.0304 1.3406 2.4546 2.2390 1.8105 1.9369 1.6205 2.4535 1.0540 1.1173 1.6640 2.4960 1.2535 1.2613 1.3362 1.4963 1.4945 2.5579 1.6110 2.1502 1.0954 1.2255 1.0632 1.8528 1.6311 1.1692 6.0692 6.1278 6.1072 1.0584 1.0609 1.0364 1.1010 1.1003 1.1007 1.1004 1.0875 1.0860 1.0912 1.0962 1.1015 1.0777
irintensity: 2.1674 0.7354 6.6368 0.4601 0.7993 0.3457 2.9332 11.0483 7.4026 8.5190 0.4823 1.7556 14.1365 38.8685 9.0217 86.7541 1.3760 1.5490 50.4459 45.2171 7.3846 14.2494 3.0674 3.2897 3.4183 6.4726 0.5001 0.1585 0.2677 2.9411 10.2159 10.5693 10.0147 18.3506 0.6784 0.1161 2.8057 55.0245 1.9680 74.7870 11.8629 3.4595 16.0933 8.6804 18.1990 6.9087 25.4159 13.6220 80.8691 19.0840 109.4116 25.5781 53.8276 0.7777 44.6970 126.3526 27.1188 42.7669 34.0204 17.3873 14.4540 39.9513 23.1293 9.5139 0.8398 13.0393 40.7176 21.8187 15.0760
temp: 298.150 k
press: 1.00000 atm
elementType: 8 7 6 6 6 6 6 6 6 6 6 6 1 1 1 1 1 1 1 1 1 1 1 1 1
symmnumber: 1
zpe: 547780.8 jmol-1
zpe.correction: 0.208639 hartree
zpe.thermalcorrener: 0.220603 hartree
zpe.thermalcorrenthalpy: 0.221547 hartree
zpe.thermalcorrgfe: 0.167212 hartree
zpe.sumelectzpe: -517.961232 hartree
zpe.sumelectthermal: -517.949268 hartree
zpe.sumelectthermalent: -517.948323 hartree
zpe.sumelectthermalfe: -518.002659 hartree
dipole: 1.3581 -0.1168 -3.5343
dipole: 3.7880
quadrupole: -68.9499 -65.5891 -77.3020
quadrupole: -1.2749 6.9422 1.3816
quadrupole: 1.6638 5.0246 -6.6884 -1.2749 6.9422 1.3816
hfenergy: -518.1698707 hartree
pointgroup: C01 [X(C10H13N1O1)]
dipole: -0.4722832 -0.6398626 1.260402 debye
dipolederiv: -0.762041 -0.0975587 -0.0280963 -0.2897287 -0.4942832 0.1678789 0.265015 0.2622787 -0.8624281 -1.3068937 -0.2265241 0.18835 -0.2560211 -0.5748113 0.0264715 0.0740526 -0.0276767 -0.330233 0.4538327 -0.0035545 0.0586581 -0.1555845 0.2919535 0.106077 0.4111435 0.1455983 0.1617582 0.2244508 -0.0431787 -0.1054588 -0.0747515 -0.0520082 -0.0153965 -0.1909052 -0.0263601 -0.0212698 -0.1816204 -0.0433164 -0.1129058 -0.1293242 0.1198002 -0.0774987 -0.1531746 -0.0679826 -0.0640308 1.355326 0.5169508 -0.0672341 0.8339811 0.5587668 -0.2911661 -0.2523165 -0.3319563 0.9297666 -0.1830965 0.0001848 -0.0099384 0.0178421 0.0702781 0.0677278 -0.0161442 0.0758279 -0.1441436 -0.0747052 0.0822727 -0.0062051 0.1516027 -0.0305804 0.0010854 0.0277455 -0.0033228 -0.1550352 0.0361644 0.0046959 0.0503856 -0.0053729 0.0775496 0.0346702 -0.0357717 0.0120841 0.009152 0.0516513 0.0866143 -0.0375926 0.1022584 0.0205758 0.0166773 -0.0148718 0.0218851 -0.1331798 -0.030889 -0.0060014 -0.0328689 -0.0231845 0.1137527 0.0712388 -0.0385168 0.0682337 -0.1208998 0.0207205 -0.0437027 -0.0741317 -0.0439923 -0.0723343 0.0375347 -0.0623166 0.0393799 -0.1417725 -0.0409437 -0.0590996 -0.0303918 -0.0104361 -0.1526543 -0.0889746 -0.0783129 -0.043433 0.0812635 0.1032065 0.0218844 0.0725988 0.0746981 0.0808688 0.0671718 -0.060771 0.0104545 0.0341886 0.2265153 -0.0745684 -0.0334266 -0.1002917 0.2529206 0.0447556 -0.0699782 0.0417524 0.0907219 0.027545 0.0460649 0.0078009 0.041141 -0.0876511 -0.0783032 -0.0149057 -0.0466878 0.0527293 -0.0056117 -0.0621875 0.0543575 -0.0366525 -0.0052218 0.1438083 0.0325521 0.0961652 -0.0841794 0.0929021 0.0536317 0.0316523 0.0276262 -0.0939315 -0.0705286 0.0204586 -0.0769785 0.1257944 -0.0036783 -0.1017409 0.020215 -0.115496 0.0297609 -0.0076257 0.0287139 -0.0052982 0.1314619 0.1206937 0.005928 0.0184613 -0.0246823 0.0302661 0.089468 0.0863032 0.0975203 -0.0165505 -0.1014077 -0.0395724 -0.1116398 -0.0504138 0.08392 -0.0598156 -0.1488306 -0.0588433 -0.0339518 0.0523736 0.017693 0.016356 0.0854905 -0.138658 -0.0623131 0.0467473 -0.0593043 0.0832407 -0.0560023 -0.1078726 0.025132 -0.1184035 0.0018468 -0.009439 0.0310982 -0.010827 0.1479929 0.0729294 0.0185989 0.0249014 0.0414717 -0.1022493 -0.0741829 0.0265591 -0.0726166 0.1292834 -0.0914216 0.0543585 0.0810209 0.0582237 0.0721236 -0.0393211 0.0864267 -0.039893 0.1303209 unknown
polarizability: 158.4216061|9.7282388|107.1067771|-11.7801439|7.9477069|79.6042047 unknown
InChI: InChI=1S/C10H13NO/c1-2-10(12)11-8-9-6-4-3-5-7-9/h3-7,11H,2,8H2,1H3
charge 0 multiplicity 1
25 atoms
O  2.499067 0.628401 -1.383764
N  1.259382 -0.627667 0.13392
C  0.157388 -0.911412 -0.80288
C  -1.199405 -0.444274 -0.286756
C  3.389028 0.368401 0.895313
C  2.362085 0.137825 -0.220594
C  -2.295185 -1.339478 -0.223831
C  -1.389979 0.902208 0.119439
C  4.836345 0.210733 0.379037
C  -3.560155 -0.901388 0.233327
C  -2.650461 1.341943 0.577668
C  -3.741009 0.440876 0.636266
H  0.121909 -1.995414 -1.027251
H  0.432084 -0.386519 -1.737669
H  1.188021 -0.98688 1.08746
H  3.246457 1.404041 1.262907
H  3.202466 -0.306615 1.752909
H  -2.159885 -2.383062 -0.535449
H  -0.5480 1.602785 0.068177
H  4.985454 0.847488 -0.509008
H  5.564311 0.505032 1.155706
H  5.044996 -0.833708 0.085847
H  -4.399289 -1.604928 0.276153
H  -2.786373 2.385428 0.883832
H  -4.719749 0.782682 0.991142
