program: Gaussian 09
title: 000154915
version: EM64L-G09RevD.01
frameworkgroup: C1[X(C14H28O4Si)]
method: RPBEPBE
basis: SDD
operation: Freq
keyword: #p
keyword: freq=noraman
keyword: PBEPBE/SDD
title: #p freq=noraman PBEPBE/SDD
converged: NO YES NO NO
title: Mulliken charges:
elementType: Si O O O O C C C C C C C C C C C C C C H H H H H H H H H H H H H H H H H H H H H H H H H H H H
charge: 1.540586 -0.321420 -0.611670 -0.629541 -0.603912 -0.106558 -0.071475 0.005253 -0.460578 -0.455035 -0.457170 -0.416067 -0.904171 -0.194647 -0.192013 -0.206135 -0.663093 -0.681372 -0.658849 0.217895 0.217098 0.280420 0.194066 0.217561 0.232197 0.202723 0.202102 0.205735 0.196151 0.232182 0.251360 0.251166 0.195160 0.219789 0.214609 0.183953 0.202114 0.195219 0.199073 0.223442 0.223010 0.193216 0.214067 0.273537 0.198469 0.225359 0.226196
chargesum: 0.00000
title: Mulliken charges with hydrogens summed into heavy atoms:
elementType: Si O O O O C C C C C C C C C C C C C C
charge: 1.540586 -0.321420 -0.611670 -0.629541 -0.603912 0.111337 0.145623 0.285674 -0.048951 -0.020115 -0.049333 0.012266 -0.401645 0.220302 0.206549 0.191198 -0.017568 -0.000552 -0.008825
polarizability: 2.02107924e+02 4.19762513e+00 1.76421113e+02 6.05249897e+00 1.09954535e+00 1.66995744e+02
1716.lowfreq: -23.3500 -16.9449 -6.8054 -0.0005 0.0009 0.0012 1.7479 11.7644 22.5016
frequency: -16.0626 -8.8497 21.4698 30.7032 38.3446 44.8948 47.5966 51.6982 60.9090 66.6138 82.5680 101.1568 125.5148 150.0946 158.0357 181.7596 229.8996 236.6105 242.6162 247.4049 271.8218 274.8261 276.5559 298.2761 309.5907 344.1105 378.4384 391.5135 409.6962 419.5286 427.2491 472.7577 521.1526 569.5593 639.4274 675.9547 693.4243 700.2181 724.9599 761.6112 769.1422 804.0494 804.7640 805.9495 826.0126 831.6085 881.9122 911.6141 931.2406 940.2280 944.7179 950.9924 953.1169 991.8269 1027.9748 1039.7182 1054.8697 1059.0641 1059.9840 1077.1655 1090.6993 1097.8243 1101.5949 1102.9169 1105.2642 1122.9400 1136.7153 1139.2177 1139.4578 1160.3975 1167.5036 1179.7824 1230.3884 1243.2883 1255.5477 1256.8182 1261.2504 1265.7058 1284.7096 1300.0162 1313.8266 1329.7989 1335.4675 1350.9878 1355.4882 1359.2560 1361.5042 1364.3251 1369.5787 1388.6214 1389.0291 1396.0967 1411.2218 1432.8614 1444.3882 1455.5009 1456.7315 1457.1720 1461.7822 1464.4590 1472.2570 1476.9516 1477.9552 1482.7939 1490.4689 1492.6636 1496.3147 2943.8810 2950.5266 2951.7917 2954.3948 2957.1572 2963.3299 2983.1099 2986.3680 2987.4326 2987.7737 2988.3652 2994.1559 2997.5821 3017.2740 3019.7796 3020.8282 3023.3735 3030.3387 3045.4079 3046.8413 3072.7580 3080.0669 3084.4857 3085.7725 3095.4476 3099.0221 3099.3384 3101.0154
redmass: 2.3495 3.8313 3.0469 3.3239 2.6603 2.0229 2.2836 3.2254 3.4853 3.2107 3.7984 4.0360 3.6381 4.4372 3.8021 2.6201 1.5907 2.2511 1.2741 2.0968 1.5739 1.8667 2.9351 3.4108 2.5023 3.3714 3.2449 4.2429 2.4034 2.9204 4.0544 2.9597 3.3828 4.1530 4.2152 3.7018 3.9738 4.5939 3.8886 2.1478 3.4923 1.0926 1.0930 1.0881 2.5152 1.6638 2.0890 2.5716 2.5429 2.5225 2.2414 2.1849 1.8355 2.4450 1.3869 1.4059 1.9788 4.8063 4.8073 5.1252 2.4086 1.5980 2.1160 2.0328 2.0940 1.4994 1.4731 1.4852 1.4548 1.4439 1.2690 1.3468 1.2362 1.3347 1.2389 1.1991 1.1302 1.1268 1.3335 1.3320 1.2888 1.3907 1.3516 1.5343 1.2910 1.3080 1.3019 1.2469 1.5573 1.2598 1.2583 1.2425 2.5394 1.0912 1.1128 1.1133 1.0417 1.0429 1.0863 1.0402 1.0866 1.0483 1.0460 1.0623 1.0812 1.0830 1.0664 1.0558 1.0623 1.0633 1.0601 1.0643 1.0573 1.0363 1.0625 1.0368 1.0597 1.0366 1.0797 1.1066 1.0973 1.0978 1.1025 1.1059 1.0984 1.1001 1.0994 1.0873 1.0981 1.0983 1.0984 1.0939 1.1023 1.1016 1.1014
irintensity: 0.0351 0.1260 0.7228 0.8102 1.3565 3.1941 2.0764 1.0910 2.6214 0.6647 1.1874 11.0776 3.2078 0.1167 3.7624 1.9601 3.1202 7.3092 1.4042 3.4827 4.0456 16.4319 10.1168 13.6809 3.2711 4.7666 16.7945 15.5267 1.7855 9.4024 5.4289 9.1228 3.4349 0.0990 5.0610 29.7008 21.1932 102.0204 74.4590 21.5562 31.9338 2.9906 4.9147 2.3305 15.8035 23.5728 15.2053 5.0172 74.0158 104.7119 52.7346 64.4263 22.2350 8.0769 2.7814 15.0075 8.1486 313.2582 371.3179 137.3635 1.7856 4.5191 9.7299 13.3587 16.4467 0.3737 5.1409 4.8154 8.8552 4.8279 4.5361 4.5008 1.9532 10.0048 2.2251 0.6898 0.6339 0.6690 9.0807 3.9074 10.4846 1.9205 2.1154 0.4639 8.8909 3.1473 8.4799 9.7664 0.6340 16.8359 40.7273 29.0357 3.8535 17.6970 7.7241 8.9095 10.6010 11.4100 0.9544 6.9850 14.9311 7.1029 3.1207 4.0866 9.0219 0.2543 5.8070 58.1511 28.3949 30.8156 48.7288 57.1485 52.0355 30.0141 36.3618 36.5161 12.1566 30.5756 6.7069 39.8214 38.7335 24.5900 35.3140 22.7682 32.3372 25.2619 50.1753 27.9157 38.8301 40.7629 40.8688 86.7235 19.1498 40.4548 42.2248
temp: 298.150 k
press: 1.00000 atm
elementType: 14 8 8 8 8 6 6 6 6 6 6 6 6 6 6 6 6 6 6 1 1 1 1 1 1 1 1 1 1 1 1 1 1 1 1 1 1 1 1 1 1 1 1 1 1 1 1
symmnumber: 1
zpe: 1057748.1 jmol-1
zpe.correction: 0.402875 hartree
zpe.thermalcorrener: 0.425504 hartree
zpe.thermalcorrenthalpy: 0.426448 hartree
zpe.thermalcorrgfe: 0.348331 hartree
zpe.sumelectzpe: -1139.050890 hartree
zpe.sumelectthermal: -1139.028260 hartree
zpe.sumelectthermalent: -1139.027316 hartree
zpe.sumelectthermalfe: -1139.105434 hartree
dipole: -0.0935 0.5498 -2.2728
dipole: 2.3402
quadrupole: -111.4705 -123.3072 -120.9528
quadrupole: 2.8275 -5.1947 5.5180
quadrupole: 7.1064 -4.7304 -2.3760 2.8275 -5.1947 5.5180
hfenergy: -1139.4537645 hartree
pointgroup: C01 [X(C14H28O4Si1)]
dipole: -0.0524456 -0.3534521 0.8485579 debye
polarizability: 202.6432695|-2.5217662|175.6949525|-5.6360626|2.2269488|167.1865578 unknown
InChI: InChI=1S/C14H28O4Si/c1-4-15-19(16-5-2,17-6-3)10-9-12-7-8-13-14(11-12)18-13/h12-14H,4-11H2,1-3H3
charge 0 multiplicity 1
47 atoms
Si -1.652825 -0.080873 0.233647
O  3.421007 1.476875 -0.571548
O  -2.036731 -1.63496 -0.391071
O  -0.755543 0.731387 -0.979315
O  -3.053588 0.906951 0.478112
C  3.502984 1.243689 0.924836
C  4.345408 0.409171 0.0028
C  1.7189 -0.603105 0.871664
C  2.259524 0.667473 1.580595
C  3.965366 -1.034725 -0.308062
C  2.886666 -1.596563 0.650825
C  0.57606 -1.270112 1.67988
C  -0.708813 -0.409802 1.845343
C  -2.468192 -1.918497 -1.769549
C  -0.66854 2.176713 -1.239295
C  -4.244484 0.549133 1.257897
C  -2.210843 -3.398755 -2.054185
C  0.385854 2.396293 -2.324514
C  -5.334388 1.580265 0.960405
H  3.983055 2.078636 1.45609
H  5.404026 0.678174 -0.114376
H  1.323908 -0.301643 -0.118961
H  2.51491 0.415825 2.633325
H  1.485114 1.458706 1.617256
H  3.599762 -1.073036 -1.352464
H  4.873998 -1.66559 -0.262596
H  3.34891 -1.832501 1.632788
H  2.497927 -2.550137 0.243549
H  0.959343 -1.537105 2.687977
H  0.299365 -2.221746 1.184747
H  -0.478018 0.561869 2.323227
H  -1.409951 -0.928612 2.529339
H  -3.547911 -1.68294 -1.86408
H  -1.907399 -1.270661 -2.472038
H  -1.665103 2.545111 -1.551293
H  -0.384109 2.710174 -0.307888
H  -4.582575 -0.472026 0.983757
H  -3.994923 0.54927 2.34015
H  -2.550735 -3.660929 -3.073994
H  -2.753824 -4.030088 -1.32944
H  -1.133644 -3.625429 -1.972779
H  0.463379 3.473037 -2.568676
H  0.108075 1.849122 -3.242628
H  1.372431 2.039525 -1.981703
H  -6.247937 1.360822 1.544689
H  -5.589501 1.570197 -0.113276
H  -4.982799 2.593217 1.222132
