program: Gaussian 09
title: 000158127
version: EM64L-G09RevD.01
frameworkgroup: C1[X(C18H21NO2)]
method: RPBEPBE
basis: SDD
operation: Freq
keyword: #p
keyword: freq=noraman
keyword: PBEPBE/SDD
title: #p freq=noraman PBEPBE/SDD
converged: YES YES NO NO
title: Mulliken charges:
elementType: O O N C C C C C C C C C C C C C C C C C C H H H H H H H H H H H H H H H H H H H H H
charge: -0.262111 -0.287212 -0.020223 0.309353 -0.263149 -0.389903 -0.747359 -0.735734 -0.272212 0.287260 0.365809 -0.790774 -0.795546 -0.480255 0.480488 -0.517979 -0.357314 0.391746 -0.211161 -0.370684 -0.258349 0.258501 0.267491 0.261286 0.213312 0.209026 0.222185 0.213946 0.223299 0.201325 0.217558 0.220218 0.228332 0.222705 0.221410 0.235721 0.227764 0.239722 0.262766 0.280304 0.238357 0.260082
chargesum: 0.00000
title: Mulliken charges with hydrogens summed into heavy atoms:
elementType: O O N C C C C C C C C C C C C C C C C C C
charge: -0.262111 -0.287212 -0.020223 0.309353 -0.004648 -0.122413 -0.063735 -0.076305 -0.070887 0.287260 0.365809 -0.124665 -0.115709 -0.012769 0.480488 -0.255213 -0.077010 0.391746 0.027196 -0.110603 -0.258349
polarizability: 2.42848979e+02 2.19080114e+01 2.15223095e+02 -1.85167021e+01 6.81681195e+00 1.85657007e+02
1716.lowfreq: -5.7568 -3.9752 -0.0005 -0.0001 0.0002 6.8491 10.0656 14.5200 22.1949
frequency: 7.8634 14.3851 22.0316 33.7711 60.3613 87.4872 98.4743 116.2937 121.3295 133.3506 140.3010 165.5261 172.8580 176.1476 185.3047 223.2184 236.8298 246.4899 266.9204 283.1607 328.7546 338.1133 358.5248 373.3058 382.8811 413.6139 420.2169 452.9992 456.3209 483.5751 505.3773 509.1832 552.5073 560.0826 617.8650 647.1863 678.2761 698.5874 720.8541 731.8826 806.1823 818.0744 821.0500 844.6057 854.8443 875.8622 907.4019 927.8533 945.8087 946.4704 950.5409 961.5918 976.5260 987.8216 989.6007 996.7519 1002.1020 1013.0489 1035.9684 1052.4594 1074.4737 1081.7889 1099.9761 1114.7083 1125.6148 1160.7687 1165.7159 1188.0983 1194.6479 1235.2294 1242.7987 1253.6283 1288.3400 1314.4614 1323.5835 1346.1779 1368.1592 1377.0912 1387.4485 1389.1904 1399.7956 1402.1467 1418.5155 1432.5428 1454.2599 1460.5272 1463.0420 1465.9446 1471.9418 1473.1152 1474.2668 1476.3241 1483.2163 1492.4959 1586.8953 1610.8318 1613.1752 1683.4283 2179.1602 2957.4307 2965.5113 2975.7442 2978.8057 3028.7991 3033.3797 3037.5096 3059.8651 3067.4797 3077.4713 3081.2124 3095.2062 3095.8872 3098.9243 3111.9699 3120.0108 3142.4793 3147.2562 3155.3823 3157.6244 3172.2822
redmass: 3.7401 4.5889 4.3057 4.5441 4.6145 4.5071 3.0396 1.4572 2.6259 5.9508 2.8051 3.9720 1.3433 1.9792 1.2883 1.6504 2.7338 3.3886 2.9520 3.5226 3.3470 3.0612 2.5481 2.4532 4.4292 2.5933 2.9444 7.4070 2.6202 3.6777 3.3536 3.0101 6.0874 6.0226 4.3516 6.3458 4.9232 2.4114 4.4083 4.9071 3.3353 2.1178 2.6301 2.7656 2.0073 2.9555 3.2889 1.7021 1.5073 1.7542 1.4751 1.6362 1.5040 5.5039 1.2570 1.7672 1.3967 1.6656 1.7740 1.6584 1.3700 1.5990 1.7090 2.2125 1.8429 1.7850 2.5997 1.0949 2.0484 1.1688 2.3909 3.5774 1.7790 1.2760 1.6858 1.3306 1.6627 7.2646 1.2425 1.2757 1.2460 1.2788 2.1719 2.9455 1.0502 1.1482 1.0542 1.0502 1.0560 1.0489 2.3428 1.0803 1.1309 1.0713 5.8677 7.6078 6.8868 6.3571 12.6329 1.0372 1.0389 1.0367 1.0365 1.0970 1.0963 1.0586 1.0990 1.0988 1.0985 1.0985 1.0890 1.0956 1.0984 1.1075 1.0875 1.0872 1.0929 1.0893 1.0932 1.0999
irintensity: 0.2352 1.0531 0.9088 1.2689 0.6647 1.6406 1.3216 1.8693 2.1741 0.6422 0.8201 0.7213 0.1740 2.0347 0.2958 0.3457 4.5675 3.5786 5.3707 4.4525 1.0180 0.7811 10.2649 9.7553 0.2773 1.5296 0.6355 0.0229 1.6307 13.6661 3.5787 2.6655 4.7745 5.7614 4.4573 6.1972 4.8803 20.1341 7.1051 25.4997 73.4744 14.4570 23.9219 12.2710 12.8108 62.8552 4.8979 19.6776 2.0102 10.0883 4.3557 8.2330 53.0396 0.2603 3.1898 11.7410 1.8098 31.9835 42.7488 56.1597 5.1756 3.1850 19.2919 389.9844 3.6686 10.8338 43.0436 2.0007 35.1816 8.8021 32.8811 9.1200 36.6514 1.9550 12.4463 14.4289 84.2457 1.4177 9.4626 42.3909 13.7496 25.9613 80.1225 6.6619 2.5105 29.9105 11.8150 7.4301 15.3734 13.3382 14.0416 4.4256 20.3862 7.6874 7.8768 89.3225 52.3935 7.8744 34.0418 41.6570 54.4674 24.5405 58.6314 6.4201 44.3885 34.3680 14.3292 44.1112 22.0205 32.1861 12.5474 39.3086 9.1145 4.8479 13.2301 3.1552 3.6598 3.1667 1.2487 9.4840
temp: 298.150 k
press: 1.00000 atm
elementType: 8 8 7 6 6 6 6 6 6 6 6 6 6 6 6 6 6 6 6 6 6 1 1 1 1 1 1 1 1 1 1 1 1 1 1 1 1 1 1 1 1 1
symmnumber: 1
zpe: 897621.1 jmol-1
zpe.correction: 0.341886 hartree
zpe.thermalcorrener: 0.364236 hartree
zpe.thermalcorrenthalpy: 0.365180 hartree
zpe.thermalcorrgfe: 0.286751 hartree
zpe.sumelectzpe: -902.127505 hartree
zpe.sumelectthermal: -902.105155 hartree
zpe.sumelectthermalent: -902.104211 hartree
zpe.sumelectthermalfe: -902.182641 hartree
dipole: -4.0414 -0.7479 1.8499
dipole: 4.5072
quadrupole: -144.8725 -119.3262 -126.0549
quadrupole: -10.9584 19.2003 10.2142
quadrupole: -14.7879 10.7583 4.0296 -10.9584 19.2003 10.2142
hfenergy: -902.4693911 hartree
pointgroup: C01 [X(C18H21N1O2)]
dipole: 1.5102826 0.3050524 0.8777316 debye
polarizability: 232.0840214|12.6517114|217.3404823|25.8258492|22.3103139|194.3045774 unknown
InChI: InChI=1S/C18H21NO2/c1-12(2)8-15-16(18(15,3)4)17(20)21-11-14-7-5-6-13(9-14)10-19/h5-9,15-16H,11H2,1-4H3
charge 0 multiplicity 1
42 atoms
O  -0.719191 1.616615 0.194748
O  0.493124 0.653929 1.950093
N  -5.295785 -1.981444 -3.084959
C  2.94924 2.254766 0.663244
C  2.959824 0.811581 0.142748
C  1.643035 1.670887 0.033932
C  3.031293 2.468568 2.173498
C  3.627517 3.359454 -0.147459
C  3.668305 0.373966 -1.086752
C  0.478895 1.25642 0.843188
C  4.070201 -0.898357 -1.385786
C  4.805001 -1.193826 -2.682724
C  3.838206 -2.109585 -0.500122
C  -1.990139 1.217327 0.89064
C  -2.429722 -0.173927 0.483714
C  -3.284852 -0.354389 -0.626906
C  -1.991261 -1.309918 1.213825
C  -3.697255 -1.658174 -1.013141
C  -2.400377 -2.607081 0.832632
C  -3.251467 -2.790308 -0.276338
C  -4.570618 -1.834319 -2.145147
H  2.883387 0.066466 0.943333
H  1.383742 2.051332 -0.957575
H  2.49599 1.681935 2.729892
H  4.090867 2.466569 2.491706
H  2.59457 3.445456 2.455624
H  4.71593 3.368352 0.051325
H  3.482947 3.243455 -1.235487
H  3.220611 4.346457 0.140109
H  3.888807 1.15891 -1.824703
H  5.796972 -1.646729 -2.483801
H  4.243238 -1.924265 -3.298791
H  4.959568 -0.283383 -3.287429
H  3.282922 -2.890924 -1.056095
H  4.803123 -2.564092 -0.198981
H  3.268716 -1.882198 0.415025
H  -2.705649 1.986392 0.560074
H  -1.823176 1.283104 1.979414
H  -3.632463 0.511933 -1.200553
H  -1.318862 -1.165123 2.066063
H  -2.057034 -3.476805 1.402136
H  -3.574979 -3.792125 -0.575915
