program: Gaussian 09
title: 000154899
version: EM64L-G09RevD.01
frameworkgroup: C1[X(C14H11NO)]
method: RPBEPBE
basis: SDD
operation: Freq
keyword: #p
keyword: freq=noraman
keyword: PBEPBE/SDD
title: #p freq=noraman PBEPBE/SDD
converged: NO YES NO NO
title: Mulliken charges:
elementType: O N C C C C C C C C C C C C C C H H H H H H H H H H H
charge: -0.278466 -0.059458 0.178808 0.058143 0.338750 0.235780 0.041060 -0.339730 -0.411073 -0.791077 -0.361310 -0.343592 -0.244960 -0.228003 -0.212072 -0.219863 0.267050 0.233055 0.253097 0.254729 0.246897 0.247647 0.211160 0.231918 0.230578 0.230910 0.230022
chargesum: 0.00000
title: Mulliken charges with hydrogens summed into heavy atoms:
elementType: O N C C C C C C C C C C C C C C
charge: -0.278466 -0.059458 0.178808 0.058143 0.338750 0.235780 0.041060 -0.072680 -0.178018 -0.085374 -0.108213 -0.088863 -0.013042 0.002575 0.018838 0.010159
polarizability: 2.95086923e+02 7.52301005e+00 1.63029142e+02 -1.61012590e-03 -3.20725871e-02 6.55781865e+01
1716.lowfreq: -8.2889 -0.4581 0.0003 0.0005 0.0007 2.4417 35.8099 63.2209 111.7815
frequency: 35.6871 63.2201 111.7814 147.5479 166.0958 225.4455 252.1180 257.0151 299.9722 323.8071 400.8110 426.4070 455.3817 509.0850 516.6206 545.1429 567.6160 573.2903 612.9769 663.0126 681.6329 731.7324 750.3695 761.9066 772.5333 779.5585 807.8383 836.2553 861.5847 871.5317 881.3330 940.7881 959.2948 964.0755 979.4535 995.6824 996.8884 1002.4430 1046.0111 1050.5624 1098.1459 1129.4439 1149.6912 1175.7577 1178.7271 1194.4026 1215.4981 1256.8462 1281.0082 1289.4778 1370.8754 1398.0603 1406.2264 1421.1035 1434.8789 1454.1480 1459.1551 1466.8696 1476.8680 1535.9499 1576.3469 1605.4178 1615.3689 1620.6637 2990.3143 3073.4185 3092.1321 3125.5509 3138.3376 3140.5343 3155.4020 3157.7890 3172.6539 3176.5767 3180.2735
redmass: 4.2322 5.1602 4.7387 2.9795 1.1415 3.7168 6.0208 4.7621 5.1880 4.8971 3.3347 2.9900 2.9896 5.5410 3.7714 6.9655 7.0146 3.7841 7.0747 6.2740 5.8927 2.0602 2.2413 1.7830 5.5162 1.7036 5.6637 11.2205 1.4045 7.1451 1.3102 1.3811 6.3271 1.3813 1.3052 1.6587 1.3372 2.0403 1.5782 2.2215 1.9550 1.7065 1.4688 1.9210 1.0949 3.3910 2.4802 3.2261 1.5774 1.4743 5.5542 4.2287 1.3642 1.8137 3.0255 1.0442 2.6656 1.1952 2.6695 8.4794 6.5778 6.6786 7.3779 7.4505 1.0365 1.0957 1.1013 1.0863 1.0862 1.0904 1.0912 1.0958 1.0958 1.0975 1.0992
irintensity: 0.1073 1.6440 0.8613 2.3375 0.1002 1.0785 0.0662 1.1308 1.9816 0.1625 0.8995 3.1672 12.4504 0.4210 0.0088 1.0064 1.6560 0.0063 1.7449 4.1937 2.9689 23.8235 46.8023 88.1459 15.5555 34.3496 29.5771 22.7810 0.0272 1.8082 0.5495 4.5070 53.2384 1.1463 0.0022 1.0476 0.0597 9.5202 9.6579 10.5690 6.4216 2.9346 7.0826 9.6965 0.7793 15.9576 15.6236 8.5806 6.2502 1.2835 0.8805 2.9011 12.3569 23.3831 14.9243 13.0824 8.0665 34.5850 41.0988 74.9925 3.9995 0.1587 4.9579 11.3911 19.4111 9.3390 30.7266 5.2028 3.4255 17.4503 14.5165 31.9713 11.7756 12.9455 15.8107
temp: 298.150 k
press: 1.00000 atm
elementType: 8 7 6 6 6 6 6 6 6 6 6 6 6 6 6 6 1 1 1 1 1 1 1 1 1 1 1
symmnumber: 1
zpe: 550512.0 jmol-1
zpe.correction: 0.209679 hartree
zpe.thermalcorrener: 0.222059 hartree
zpe.thermalcorrenthalpy: 0.223004 hartree
zpe.thermalcorrgfe: 0.170444 hartree
zpe.sumelectzpe: -668.973716 hartree
zpe.sumelectthermal: -668.961336 hartree
zpe.sumelectthermalent: -668.960392 hartree
zpe.sumelectthermalfe: -669.012952 hartree
dipole: 0.1013 -0.5523 0.0034
dipole: 0.5616
quadrupole: -72.4992 -84.8621 -98.4620
quadrupole: -0.8384 -0.0003 0.0112
quadrupole: 12.7752 0.4123 -13.1876 -0.8384 -0.0003 0.0112
hfenergy: -669.1833955 hartree
pointgroup: C01 [X(C14H11N1O1)]
dipole: 0.0352623 -0.217771 0.0120076 debye
polarizability: 295.3366359|4.805563|162.5468533|1.1021219|-4.6692892|65.810762 unknown
InChI: InChI=1S/C14H11NO/c1-10-6-2-3-7-11(10)14-15-12-8-4-5-9-13(12)16-14/h2-9H,1H3
charge 0 multiplicity 1
27 atoms
O  0.620992 -1.206705 0.028454
N  0.63451 1.112849 -0.090391
C  -1.594176 -0.115812 -0.041156
C  -0.139361 0.029347 -0.03931
C  -2.46941 1.020839 -0.098318
C  1.962895 -0.782543 0.014341
C  1.969589 0.640216 -0.058784
C  -2.140608 -1.432036 0.016241
C  -3.865996 0.777519 -0.094993
C  -1.969845 2.450073 -0.161044
C  3.123125 -1.564039 0.061572
C  3.1951 1.338443 -0.087796
C  -3.530963 -1.640331 0.017857
C  -4.401575 -0.52747 -0.038063
C  4.346387 -0.851048 0.031938
C  4.380629 0.571178 -0.041434
H  -1.456332 -2.283748 0.059212
H  -4.544765 1.6372 -0.138262
H  3.089365 -2.655175 0.117585
H  3.216477 2.430384 -0.143842
H  -1.33896 2.697695 0.710906
H  -1.323506 2.615634 -1.040872
H  -2.819428 3.153248 -0.200876
H  -3.932408 -2.658175 0.062069
H  -5.487471 -0.673673 -0.037525
H  5.28868 -1.408201 0.066322
H  5.350752 1.078932 -0.062132
