program: Gaussian 09
title: 000154890
version: EM64L-G09RevD.01
frameworkgroup: C1[X(C8H10O3)]
method: RPBEPBE
basis: SDD
operation: Freq
keyword: #pfreq=noraman
keyword: PBEPBE/SDD
title: #p freq=noraman PBEPBE/SDD
converged: YES YES NO NO
title: Mulliken charges:
elementType: O O O C C C C C C C C H H H H H H H H H H
charge: -0.212077 -0.420313 -0.221969 -0.098710 -0.145591 -0.508829 -0.078198 -0.307803 0.194991 0.012989 -0.577982 0.235035 0.195064 0.205475 0.239635 0.239963 0.256933 0.211934 0.340590 0.221023 0.217840
chargesum: 0.00000
title: Mulliken charges with hydrogens summed into heavy atoms:
elementType: O O O C C C C C C C C
charge: -0.212077 -0.079724 -0.221969 0.136325 0.049472 -0.063719 0.161765 -0.050869 0.194991 0.224923 -0.139118
polarizability: 9.52632147e+01 1.12534713e+01 1.06639971e+02 -4.45559781e+00 3.83064245e+00 7.25514355e+01
1716.lowfreq: -11.8190 -8.6218 -0.0005 0.0006 0.0006 10.8068 43.8696 53.4073 67.6808
frequency: 43.8121 53.3388 67.6506 128.9528 153.3376 222.3356 237.7083 285.8639 315.4419 385.1495 410.6609 455.7650 477.8370 541.4622 563.8254 627.5029 675.0627 723.0716 808.8859 853.7819 881.6671 886.0905 917.6884 947.9318 967.4228 981.7692 996.0958 996.6833 1042.8761 1054.6329 1118.5944 1126.4894 1181.3974 1209.1220 1228.8003 1248.7985 1292.4921 1307.1918 1328.8996 1343.5139 1356.8061 1397.0481 1428.7949 1448.6278 1624.9843 1666.4257 1669.4619 2947.8808 2957.3775 3018.8388 3047.6708 3081.5328 3097.7224 3144.9648 3177.4376 3201.9556 3539.6410
redmass: 2.6919 3.6435 4.6450 3.7149 3.2214 3.9635 1.1423 5.0282 4.2917 2.3236 5.2495 3.3078 3.4175 3.9061 3.9823 1.7543 3.7182 4.9896 2.0130 3.9408 2.9976 3.6529 1.8170 1.3391 2.3203 2.5210 1.2620 1.3804 3.0477 2.3338 1.8356 2.1557 1.0937 1.3683 1.4345 1.2091 1.2289 1.3658 1.5014 1.2418 1.4805 1.7413 1.1681 1.1101 9.7918 4.8312 8.0122 1.0737 1.0749 1.0862 1.0929 1.0775 1.0768 1.0880 1.0999 1.1146 1.0663
irintensity: 0.0191 0.9581 1.3257 1.2532 2.0034 15.7816 149.5943 12.4053 4.6267 0.1122 3.6587 4.3266 7.5610 8.1080 8.9806 16.3527 10.1560 12.6807 29.7525 15.9371 52.9500 9.0575 20.9909 56.3810 75.1476 60.0568 4.1316 2.6901 54.5775 74.0927 42.3914 7.3796 59.8494 25.4417 30.7499 1.9743 3.8014 9.8683 1.5204 4.7901 16.7667 3.8385 5.4214 13.9635 152.2942 11.3924 117.5965 7.4561 67.8623 14.7681 18.5976 29.6154 4.3870 5.6913 9.3740 25.1264 8.2149
temp: 298.150 k
press: 1.00000 atm
elementType: 8 8 8 6 6 6 6 6 6 6 6 1 1 1 1 1 1 1 1 1 1
symmnumber: 1
zpe: 430038.2 jmol-1
zpe.correction: 0.163793 hartree
zpe.thermalcorrener: 0.174914 hartree
zpe.thermalcorrenthalpy: 0.175858 hartree
zpe.thermalcorrgfe: 0.125986 hartree
zpe.sumelectzpe: -535.628117 hartree
zpe.sumelectthermal: -535.616996 hartree
zpe.sumelectthermalent: -535.616051 hartree
zpe.sumelectthermalfe: -535.665924 hartree
dipole: 0.3409 -5.6936 2.6754
dipole: 6.3000
quadrupole: -66.5058 -67.4404 -62.4140
quadrupole: 1.3068 -4.0384 8.3844
quadrupole: -1.0524 -1.9870 3.0394 1.3068 -4.0384 8.3844
hfenergy: -535.7919096 hartree
pointgroup: C01 [X(C8H10O3)]
dipole: 0.087631 -2.2402151 1.0570505 debye
dipolederiv: -0.6101607 0.3021462 0.064545 0.4020747 -1.0489042 -0.0561457 0.2335088 -0.3005259 -0.418687 -0.6981408 -0.3070426 -0.1699866 -0.3041439 -0.3813699 0.0331676 -0.2142709 -0.0582849 -0.5544691 -0.4303919 -0.093984 0.085276 0.1428101 -1.1027281 0.0763025 0.0882482 0.1948586 -0.4336669 0.2064684 -0.1084992 0.0367914 -0.2554707 0.5867857 -0.0219431 0.2152419 -0.0686408 0.2394099 0.4874732 0.0917479 0.2804616 0.2302925 0.3973724 0.0022079 0.2182999 0.1992862 0.4302124 -0.0881404 -0.0159215 -0.0347725 -0.0714954 0.0597299 -0.0231488 0.0031345 0.0012728 0.009963 -0.0251641 0.1133681 -0.1712405 0.0568373 0.0440569 -0.0347612 -0.1679283 0.0378823 -0.0250348 -0.2195461 -0.1483991 0.0532197 -0.119924 -0.1018608 0.1670775 0.041157 0.1039963 -0.1477241 0.7604427 -0.093461 -0.3398561 -0.3614874 1.6484724 -0.0083561 -0.5223818 0.0699794 0.6412091 0.2100958 0.0836829 -0.0774521 0.126414 -0.0707607 0.1369059 -0.2299179 0.1352557 0.0637167 -0.2084245 0.053174 -0.1598439 0.0466976 -0.2096944 0.1633119 -0.1538724 0.1375657 -0.0441328 0.0564701 0.0313714 0.020173 0.0312532 -0.0646158 -0.0783768 0.0125463 -0.0916654 -0.0617908 0.0168842 0.0088618 -0.0650001 0.0482596 -0.1456121 0.1022724 -0.0752705 0.0607327 -0.0547777 -0.0028244 -0.047154 0.0127651 -0.0301552 -0.1395746 0.0742783 0.0210983 0.0778572 0.0793066 0.0365092 0.0016456 0.0216911 0.0213886 0.0220535 -0.1094904 0.0419526 -0.0655454 -0.0467447 0.0334373 -0.0056295 0.11996 -0.023183 0.0591386 0.0208656 0.1270617 0.0135938 0.0242044 0.119048 0.0260475 0.0702439 0.0431823 0.0178697 -0.0685413 0.0904278 -0.0357402 0.0672653 0.044644 -0.0297367 0.0225838 -0.0213973 0.0623477 -0.1227894 0.0885065 -0.1120926 -0.0619404 0.2806519 0.1851078 0.0547266 0.1338438 0.1395609 -0.1050353 0.0101633 -0.1561191 0.2498068 -0.0657331 -0.051911 0.0928121 -0.0774651 0.1394034 -0.0387757 0.1153139 -0.0269082 0.0759303 0.0964013 0.0045856 0.0829027 -0.0183316 0.0883295 -0.1090256 0.0569811 -0.1167582 -0.0320561 unknown
polarizability: 95.7007471|11.3407432|106.3395392|-4.0728367|4.0150005|72.4143348 unknown
InChI: InChI=1S/C8H10O3/c1-2-3-7-6(9)4-5-8(10)11-7/h2,4-7,9H,1,3H2
charge 0 multiplicity 1
21 atoms
O  0.060304 0.519624 -0.980994
O  -2.355699 -1.516363 -0.802687
O  -0.386711 2.726583 -0.555075
C  0.063873 -0.87693 -0.459651
C  -1.284555 -1.276557 0.185521
C  1.257436 -1.077026 0.509146
C  -1.809585 -0.183293 1.088634
C  -1.442758 1.110751 0.894897
C  -0.558132 1.533207 -0.226037
C  2.600366 -0.791723 -0.129816
C  3.538107 0.043991 0.37714
H  0.22876 -1.480608 -1.372569
H  -1.109458 -2.20217 0.777207
H  1.230876 -2.1385 0.840027
H  1.122691 -0.453519 1.412104
H  -2.535612 -0.461049 1.860419
H  -1.833469 1.928572 1.507973
H  2.807066 -1.322803 -1.072356
H  -2.131369 -2.321831 -1.337642
H  4.497224 0.201873 -0.12766
H  3.368648 0.60787 1.302718
