program: Gaussian 09
title: 000013833
version: EM64L-G09RevD.01
frameworkgroup: C1[X(C6H10N3O3)]
method: RPBEPBE
basis: SDD
operation: Freq
keyword: #p
keyword: freq=noraman
keyword: PBEPBE/SDD
title: #p freq=noraman PBEPBE/SDD
converged: YES YES NO NO
title: Mulliken charges:
elementType: O O O N N N C C C C C C H H H H H H H H H H
charge: -0.225048 -0.262068 -0.369385 -0.331687 0.055029 0.106905 -0.433886 -0.235283 0.268449 -0.655184 0.393673 -0.283623 0.305981 0.305936 0.251341 0.251334 0.397408 0.238593 0.240047 0.240058 0.320181 0.421230
chargesum: 1.00000
title: Mulliken charges with hydrogens summed into heavy atoms:
elementType: O O O N N N C C C C C C
charge: -0.225048 -0.262068 0.051845 0.065721 0.055029 0.106905 0.178032 0.267391 0.268449 0.063514 0.393673 0.036558
polarizability: 1.89916021e+02 -1.72671881e+00 8.14504197e+01 4.30513298e-02 -7.82178918e-04 5.17552851e+01
1716.lowfreq: -1.9185 -0.0011 -0.0008 -0.0005 4.5941 12.5438 30.0892 47.1960 62.8804
frequency: 29.6017 46.8344 62.8716 71.8535 95.3753 136.8685 143.4724 192.9263 195.5631 240.7880 247.0713 322.3241 361.4598 389.0096 422.7067 486.9304 520.2566 546.7852 585.1526 648.0375 696.2139 735.3313 783.5093 798.0493 847.5110 898.8360 923.0360 980.9341 1000.2180 1054.2205 1116.4725 1132.5216 1143.4935 1169.8973 1191.5983 1228.1273 1250.3519 1252.7118 1332.5346 1365.5563 1409.6345 1424.4574 1452.7683 1463.0005 1464.1210 1468.7239 1481.3880 1624.0669 1651.9820 2068.1308 3006.3465 3025.3625 3030.2450 3084.8695 3095.3853 3102.1908 3124.0017 3182.0349 3267.1800 3578.4591
redmass: 4.9312 2.6054 5.6747 3.9615 4.8823 5.8383 2.3440 6.4141 2.1920 5.9241 1.3194 7.3099 3.6259 1.3098 6.9448 4.1283 5.0032 2.9112 2.1389 6.5619 3.0270 4.5785 4.4839 1.1009 1.1208 6.5324 4.7441 2.0419 2.0296 5.9921 2.2963 1.4438 1.3587 2.5215 1.0935 2.6398 1.3088 1.1375 1.6002 1.6124 1.2458 1.7720 2.2022 1.5191 1.0382 1.0822 1.0644 6.6776 6.7556 13.3865 1.0367 1.0594 1.0583 1.1038 1.1072 1.0981 1.1048 1.0905 1.0794 1.0683
irintensity: 0.1717 2.0295 1.5355 17.0395 0.1598 6.0770 0.6509 22.8489 27.4318 0.7068 3.4231 35.0306 11.1170 127.1008 8.3167 1.4522 10.2882 1.9294 21.1861 14.2047 16.2992 8.8369 56.7284 4.8153 172.9831 57.9322 28.4337 0.2100 84.3452 31.6515 3.5664 8.3640 158.9924 27.9977 1.6807 407.0041 168.6931 0.6278 69.1475 17.1216 28.4035 14.6948 178.5008 159.7058 16.8584 2.7403 16.8344 204.4008 691.7184 355.0105 6.4428 1.0407 8.4325 0.0322 0.8808 12.9302 29.1158 25.0135 566.7968 82.6305
temp: 298.150 k
press: 1.00000 atm
elementType: 8 8 8 7 7 7 6 6 6 6 6 6 1 1 1 1 1 1 1 1 1 1
symmnumber: 1
zpe: 440533.0 jmol-1
zpe.correction: 0.167790 hartree
zpe.thermalcorrener: 0.181287 hartree
zpe.thermalcorrenthalpy: 0.182231 hartree
zpe.thermalcorrgfe: 0.126038 hartree
zpe.sumelectzpe: -623.346593 hartree
zpe.sumelectthermal: -623.333096 hartree
zpe.sumelectthermalent: -623.332152 hartree
zpe.sumelectthermalfe: -623.388345 hartree
dipole: 5.7121 0.7862 0.0004
dipole: 5.7659
quadrupole: -5.6691 -63.0675 -67.2299
quadrupole: 0.2988 0.0022 0.0043
quadrupole: 39.6531 -17.7454 -21.9077 0.2988 0.0022 0.0043
hfenergy: -623.514383 hartree
pointgroup: C01 [X(C6H10N3O3)]
dipole: 2.2543928 -0.2524615 0.0009761 debye
dipolederiv: -2.0011409 -0.2325674 -0.0012572 -0.2577451 -0.5011837 0.0002192 -0.0022387 -0.0000156 -0.2557906 -0.9846154 -0.0099112 -0.0003933 -0.4280567 -0.8650468 0.0002101 0.0002389 0.0012361 -0.3006107 -0.3354684 0.1953087 -0.0004572 0.200792 -1.0141404 0.0006607 -0.0003108 0.0006738 -0.3803684 -1.6747687 -0.0050051 0.0003326 0.6964283 -0.3069427 -0.0000014 -0.0003308 -0.0001329 -0.3312186 1.960689 -0.0035192 -0.0005555 -0.5723016 -0.0543682 0.0004762 0.0001344 0.000287 0.1836225 -0.9833416 -0.069741 0.0004307 0.3031793 0.0467528 -0.0001039 -0.000083 0.0000146 0.040197 0.2109533 0.2076153 -0.000868 0.3257277 -0.0243788 0.0006171 -0.0003648 0.0004611 0.2610511 1.2190013 0.0204936 0.0009233 -0.2290744 0.2351695 -0.0000548 0.0016362 0.0002073 0.3400193 1.9746565 0.1203837 0.0013157 0.6417727 1.1661812 -0.000684 0.0006518 -0.001501 0.2003677 -0.2028644 -0.0594924 -0.0001767 -0.0245873 -0.0017216 0.0000351 -0.0003004 0.0000178 0.0491429 2.2680002 0.085367 -0.0008107 0.2017133 1.2251501 -0.0010148 -0.0014678 -0.0010124 0.3733428 -1.4310339 -0.1566246 0.000546 -0.2455548 -0.1315875 -0.0001133 0.0007943 -0.000124 -0.2603404 -0.0119926 0.002695 0.011299 -0.035488 0.1028306 -0.0364424 0.0109848 -0.0477212 0.0458139 -0.0120772 0.0025647 -0.0111707 -0.0357291 0.1030825 0.0361693 -0.0109497 0.0475604 0.0452554 -0.0497558 -0.0397104 -0.0509239 0.0498657 0.0227433 -0.0710164 -0.0289002 -0.0917441 -0.0288054 -0.0500244 -0.0397779 0.0510541 0.0497495 0.0233504 0.0709288 0.0286991 0.09145 -0.0292303 0.7100081 -0.0321678 0.0002991 -0.5280115 0.2576433 0.000037 0.0010482 0.0001494 0.3086909 -0.060377 0.0708768 -0.0003883 0.0715612 0.038116 0.0002932 -0.0004146 0.0002849 0.1335553 0.1276141 0.0119374 0.0365253 -0.0469483 0.0265095 -0.0905097 0.0173864 -0.1009214 -0.0423274 0.1277639 0.0115115 -0.0361236 -0.0472726 0.0272431 0.0901231 -0.0167239 0.1006824 -0.0431913 0.0820024 -0.0113512 0.0001001 -0.0200456 0.1711628 0.000137 0.0001554 0.000141 0.2666419 0.1167718 -0.0688854 0.0002992 -0.0699747 0.4534347 0.0000339 0.0003552 0.0000067 0.4241825 unknown
polarizability: 189.7596256|4.4634146|81.6067682|-0.0011232|-0.0423372|51.7553319 unknown
InChI: InChI=1S/C6H10N3O3/c1-2-12-6(11)4-8-5(10)3-9-7/h3,8,10H,2,4H2,1H3
charge 1 multiplicity 1
22 atoms
O  -2.96402 -0.466152 0.000437
O  -1.672792 1.486346 -0.001617
O  2.04505 -1.516863 0.003301
N  0.57798 0.212237 0.002177
N  4.199119 0.456927 0.000058
N  5.345333 0.205922 0.000075
C  -0.582925 -0.696585 0.003604
C  -4.26733 0.325694 -0.002847
C  -1.807875 0.232882 0.001083
C  -5.396185 -0.691395 -0.002489
C  1.856382 -0.164572 0.001824
C  2.910591 0.809884 0.000068
H  -0.58635 -1.350615 -0.886143
H  -0.587308 -1.346326 0.89653
H  -4.254706 0.966268 0.895707
H  -4.252224 0.962874 -0.903772
H  0.282354 1.21162 0.001099
H  -6.362284 -0.155593 -0.004873
H  -5.360054 -1.33374 -0.89784
H  -5.362571 -1.330304 0.895414
H  2.702315 1.881783 -0.001286
H  2.9821 -1.837893 0.002792
