program: Gaussian 09
title: 000154876
version: EM64L-G09RevD.01
frameworkgroup: C1[X(C12H11NO2)]
method: RPBEPBE
basis: SDD
operation: Freq
keyword: #p
keyword: freq=noraman
keyword: PBEPBE/SDD
title: #p freq=noraman PBEPBE/SDD
converged: YES YES NO NO
title: Mulliken charges:
elementType: O O N C C C C C C C C C C C C H H H H H H H H H H H
charge: -0.281558 -0.209762 0.013577 -0.185005 0.418729 0.251309 -0.403066 -0.344070 -0.320089 -0.239867 0.157943 -0.175442 -0.372460 -0.217962 -0.674035 0.237721 0.262442 0.244323 0.234769 0.231989 0.225751 0.231892 0.245406 0.210591 0.232210 0.224665
chargesum: 0.00000
title: Mulliken charges with hydrogens summed into heavy atoms:
elementType: O O N C C C C C C C C C C C C
charge: -0.281558 -0.209762 0.013577 -0.185005 0.418729 0.251309 -0.165345 -0.081628 -0.075766 -0.005099 0.157943 0.056547 -0.127055 0.239681 -0.006569
polarizability: 1.97443253e+02 1.22148383e+01 1.65884326e+02 7.48072459e+00 1.77056538e+00 7.19424684e+01
1716.lowfreq: -5.3736 -0.0004 0.0000 0.0007 7.0870 8.4204 25.2963 61.2673 69.7942
frequency: 25.0375 61.2574 69.7869 102.8385 139.8609 174.3021 188.2124 221.4706 255.9686 289.7870 351.3311 372.6922 407.4423 448.7716 467.1449 510.6011 528.9188 574.9236 629.3221 644.3790 706.8171 747.5551 772.6069 797.2661 799.2796 806.3080 814.0752 851.3597 865.2716 930.0259 946.4551 970.7853 984.7541 994.9083 1026.7305 1028.2382 1071.6655 1102.7479 1112.5992 1135.2171 1146.3609 1182.0935 1217.7064 1243.5280 1246.0949 1257.6956 1340.9737 1353.5203 1376.9292 1395.9449 1399.5130 1422.1184 1455.0999 1463.4994 1473.7408 1486.7263 1492.8616 1560.0893 1591.9622 1610.5972 1640.3634 2994.5056 3007.0563 3065.2948 3091.0486 3105.7075 3123.0540 3124.4224 3131.7548 3151.8324 3166.9935 3172.7100
redmass: 3.9530 2.9342 4.7388 3.1937 3.8084 3.9509 3.9372 3.4217 1.4454 4.7377 5.9663 3.8660 4.5280 4.5086 3.1436 5.4980 7.0653 4.8714 5.4182 4.4911 4.5568 6.0441 1.4484 2.0723 1.4938 2.4007 3.1057 2.6662 5.0300 1.3852 1.4585 5.1747 1.3678 1.3949 2.7221 2.6497 2.1632 3.1737 2.2177 1.4629 1.3756 1.3619 2.1769 1.6402 1.1404 2.3455 5.3386 1.3750 2.0735 2.2527 1.2736 2.9317 2.8144 1.0409 1.0596 1.0730 4.0643 6.7582 5.7968 7.2659 10.9501 1.0358 1.0583 1.1063 1.0986 1.1024 1.0889 1.0884 1.0908 1.0927 1.0992 1.0969
irintensity: 1.3307 1.7677 2.9227 1.6311 0.7364 5.6861 0.7172 1.4373 0.8092 5.7081 7.5387 2.6238 3.5121 2.5020 0.2647 6.3095 0.0819 3.5256 6.5958 5.6113 4.8533 3.1818 7.0071 10.0924 0.6365 46.1507 36.4488 36.5204 12.2907 1.9461 1.1245 109.4659 1.1895 3.3684 90.9890 35.4477 7.3020 186.2803 11.9144 6.1014 72.4458 78.5258 10.1685 14.1474 0.7590 107.0255 5.9165 1.7660 3.7079 2.9459 20.7524 1.4224 3.9519 12.2653 5.6766 12.7079 20.1108 31.2843 13.7933 20.2326 143.8873 24.3036 21.2151 7.7383 32.6187 43.7103 14.7972 3.6168 13.7114 18.2993 31.5418 9.9041
temp: 298.150 k
press: 1.00000 atm
elementType: 8 8 7 6 6 6 6 6 6 6 6 6 6 6 6 1 1 1 1 1 1 1 1 1 1 1
symmnumber: 1
zpe: 528872.1 jmol-1
zpe.correction: 0.201437 hartree
zpe.thermalcorrener: 0.214450 hartree
zpe.thermalcorrenthalpy: 0.215394 hartree
zpe.thermalcorrgfe: 0.160642 hartree
zpe.sumelectzpe: -668.016203 hartree
zpe.sumelectthermal: -668.003190 hartree
zpe.sumelectthermalent: -668.002246 hartree
zpe.sumelectthermalfe: -668.056998 hartree
dipole: -1.3789 2.8150 -1.1775
dipole: 3.3484
quadrupole: -60.6526 -81.7641 -92.4527
quadrupole: 1.2115 0.6386 4.8048
quadrupole: 17.6372 -3.4743 -14.1629 1.2115 0.6386 4.8048
hfenergy: -668.21764 hartree
pointgroup: C01 [X(C12H11N1O2)]
dipole: 0.5183763 -1.1311571 -0.432676 debye
dipolederiv: -1.7619288 0.0102554 -0.3385474 -0.0666495 -0.399506 -0.1519075 -0.4960097 -0.0890091 -0.4644465 -0.7271079 0.1898978 0.0279792 0.0119321 -0.6612879 -0.3357294 -0.1836288 -0.2174034 -0.5199749 -0.3974496 -0.0854142 0.0224348 -0.1353382 -0.2793156 0.0291158 0.0416489 0.0443069 -0.206723 0.2474827 0.1925271 -0.0611552 0.2117829 0.0881396 -0.045627 -0.0060913 -0.0759008 0.0312717 -0.2182636 -0.000476 0.0370673 0.1374562 -0.1153896 0.004273 0.0282944 0.0223035 0.0919191 -0.2849151 0.0741605 -0.0007015 0.181149 -0.1503809 -0.0513917 -0.0098503 -0.0317325 -0.0291102 0.0795376 -0.0636721 -0.0210785 0.0168016 0.0865191 -0.0173727 -0.0276556 -0.0161927 -0.1596957 0.0858025 0.0532365 -0.0243281 -0.1349368 -0.0562762 0.0058257 -0.0693051 0.0372146 -0.1067063 0.1926665 0.0288995 -0.0451196 -0.0653346 0.1706389 -0.0177559 -0.0336105 -0.0243533 -0.1379208 -0.2227985 -0.0420073 0.0113311 -0.0232026 0.1670409 -0.0113304 0.0160107 -0.0046859 -0.1480897 2.0026082 -0.2589933 0.2546385 -0.0013638 0.8066276 0.5590443 0.5669612 0.3311481 0.6497083 0.0383442 0.1684594 -0.0351507 0.0365572 -0.3117805 0.0169662 -0.0216819 0.0158205 -0.1133722 0.2024287 -0.1669373 -0.0087698 0.0258983 0.4292972 -0.0552784 -0.0384628 -0.0378585 -0.0486992 0.9614064 -0.0624832 0.0833113 -0.2302583 0.286849 -0.0724781 0.0581614 -0.0489963 0.3268141 -0.1074098 -0.0434933 -0.0705555 -0.0227864 0.0385587 -0.0313374 -0.055717 -0.0358096 0.0173723 -0.0470198 0.1241686 0.0134473 0.0534785 0.0097354 0.0060551 0.0173552 -0.0057051 0.154983 -0.015411 -0.0610441 0.0312033 -0.0721834 0.0878151 0.0068128 0.04134 -0.0043609 0.1401622 -0.0289764 0.0561599 0.0145017 0.1249706 0.0142316 -0.0033983 0.0083876 0.0002897 0.1440741 0.0781207 -0.0297006 0.0110906 -0.0084004 -0.1181755 0.0167642 0.0154149 0.0177133 0.1571885 -0.0836741 -0.0894404 0.0347534 -0.0852735 0.0575963 0.0196225 0.0362553 0.0203222 0.1581521 -0.0740111 0.0133625 -0.0141831 0.0609579 0.057793 0.0117018 0.0663584 -0.0197125 -0.1362842 -0.0504025 -0.0555198 -0.003134 0.0469748 -0.0981662 0.0573777 0.0105333 0.0488209 0.0533467 0.0652999 -0.0294271 0.0101119 -0.0600723 -0.1231678 0.0356183 0.0165653 0.0281283 0.121409 -0.153467 0.0889519 -0.0023454 0.1106848 0.0422858 -0.0226645 0.0054264 -0.0251077 0.0981831 0.1033626 -0.0057466 0.0770517 -0.0381986 0.0893322 -0.008977 0.0199475 -0.0101049 -0.1318343 0.115775 -0.005724 -0.0038533 -0.0746454 -0.1190142 0.056071 -0.0066474 0.0808651 0.0582729 unknown
polarizability: 197.9295029|11.3167476|165.2191899|-7.975788|-4.2095677|72.1213551 unknown
InChI: InChI=1S/C12H11NO2/c1-2-15-12(14)10-7-3-5-9-6-4-8-13-11(9)10/h3-8H,2H2,1H3
charge 0 multiplicity 1
26 atoms
O  -2.688185 -0.065923 -0.204546
O  -1.629245 1.522838 1.13584
N  1.071025 1.543069 -0.144837
C  0.942607 0.171284 0.027506
C  2.083629 -0.723122 -0.044701
C  -0.368191 -0.393819 0.2388
C  1.890409 -2.136854 0.068792
C  -0.519351 -1.787201 0.310524
C  3.377853 -0.140027 -0.245382
C  0.60677 -2.659755 0.231314
C  -1.567208 0.481583 0.448006
C  3.495778 1.242752 -0.383139
C  2.30603 2.040383 -0.340445
C  -3.966401 0.68591 -0.018103
C  -5.02903 -0.043745 -0.833585
H  2.762266 -2.800458 0.017839
H  -1.52283 -2.202623 0.441631
H  4.25817 -0.791598 -0.294993
H  0.454967 -3.741561 0.30542
H  4.467259 1.722723 -0.536099
H  -4.202226 0.712406 1.06178
H  -3.809247 1.725459 -0.358079
H  2.368974 3.126848 -0.477262
H  -5.999824 0.475407 -0.733662
H  -4.755982 -0.068266 -1.902354
H  -5.153916 -1.082708 -0.482663
