program: Gaussian 09
title: 000154867
version: EM64L-G09RevD.01
frameworkgroup: C1[X(C7H4ClN3)]
method: RPBEPBE
basis: SDD
operation: Freq
keyword: #p
keyword: freq=noraman
keyword: PBEPBE/SDD
title: #p freq=noraman PBEPBE/SDD
converged: NO NO NO NO
title: Mulliken charges:
elementType: Cl N N N C C C C C C C H H H H
charge: 0.042635 0.021369 -0.037024 0.000131 0.368501 0.092514 -0.273065 -0.417002 -0.324890 -0.145507 -0.345437 0.256612 0.260280 0.243951 0.256931
chargesum: 0.00000
title: Mulliken charges with hydrogens summed into heavy atoms:
elementType: Cl N N N C C C C C C C
charge: 0.042635 0.021369 -0.037024 0.000131 0.368501 0.092514 -0.016453 -0.156722 -0.324890 0.098443 -0.088506
polarizability: 1.39995425e+02 2.59354385e+00 1.25116906e+02 -2.92092845e-03 1.45213881e-03 3.98430855e+01
1716.lowfreq: -1.5635 -0.0014 0.0012 0.0017 8.5327 14.0651 93.1082 165.1273 194.1447
frequency: 93.0257 165.1213 194.1443 222.4524 377.5482 405.8366 417.6626 430.2450 517.4013 525.1020 556.0090 649.1649 650.4331 790.0666 801.8558 814.2768 837.3194 897.3137 931.1736 954.7717 966.5759 999.1984 1028.3984 1128.5903 1206.2456 1220.5408 1262.4290 1264.9257 1344.3002 1375.5307 1388.7566 1427.0278 1490.1439 1532.8128 1593.0303 3134.5423 3135.3997 3143.0025 3172.0694
redmass: 6.8278 6.0686 11.4946 4.9338 17.1322 4.6448 5.8281 4.6861 10.1372 9.1019 4.3289 4.8556 8.3962 8.1814 1.3151 4.5342 7.4230 1.4651 7.6941 1.4268 7.5207 1.3956 2.5416 1.5449 2.7463 2.3278 2.6566 3.7984 2.8519 3.2800 2.2956 2.6840 5.3860 5.4403 6.3755 1.0917 1.0895 1.0918 1.0997
irintensity: 4.5447 0.6401 1.1992 1.0495 4.2196 2.9447 0.5723 0.2209 0.8288 7.8476 9.3661 1.2833 18.7650 10.0736 41.5097 0.8511 14.7413 30.6999 3.8009 0.3186 46.9981 0.8397 2.4166 0.3608 4.2337 61.7280 7.0784 114.6484 4.4089 16.5402 4.1365 19.9038 3.3801 10.4073 7.6831 7.3748 4.8517 8.6484 17.3975
temp: 298.150 k
press: 1.00000 atm
elementType: 17 7 7 7 6 6 6 6 6 6 6 1 1 1 1
symmnumber: 1
zpe: 257462.9 jmol-1
zpe.correction: 0.098062 hartree
zpe.thermalcorrener: 0.106124 hartree
zpe.thermalcorrenthalpy: 0.107068 hartree
zpe.thermalcorrgfe: 0.064396 hartree
zpe.sumelectzpe: -892.653525 hartree
zpe.sumelectthermal: -892.645464 hartree
zpe.sumelectthermalent: -892.644520 hartree
zpe.sumelectthermalfe: -892.687191 hartree
dipole: -7.2594 -0.6525 0.0002
dipole: 7.2887
quadrupole: -63.6712 -72.8629 -70.4760
quadrupole: -4.9358 -0.0003 0.0002
quadrupole: 5.3321 -3.8595 -1.4726 -4.9358 -0.0003 0.0002
hfenergy: -892.7515876 hartree
pointgroup: C01 [X(C7H4Cl1N3)]
dipole: 2.7236712 0.8970286 -0.0000844 debye
dipolederiv: -0.1617494 -0.2382891 0.0000071 -0.3558238 -0.7672148 0.0000218 0.0000061 0.0000074 -0.0412471 -0.456645 0.1026883 -0.0000005 0.0252858 -0.2455156 -0.0000014 -0.0000007 -0.0000001 -0.2185894 -0.1134333 -0.1670725 0.000006 0.1670358 0.0793502 -0.0000179 0.0000056 -0.0000087 -0.228838 -0.1050687 0.45437 -0.00001 -0.2375272 -0.6199219 0.0000112 -0.0000065 0.0000035 -0.1767859 -0.0886153 -0.0279177 0.0000025 0.0072484 -0.1549144 0.0000101 0.0000086 0.0000144 0.1271729 0.1131862 -0.272499 0.0000079 -0.1879334 -0.1867365 0.0000136 0.0000106 0.0000137 0.1356365 0.0640346 0.0049102 -0.0000039 0.0923571 0.1916023 -0.0000124 -0.0000045 -0.0000127 -0.1241129 0.040175 0.0222739 -0.0000022 -0.1136598 0.2072899 -0.0000058 -0.0000063 -0.0000117 -0.0052644 0.3488441 0.1924711 -0.000015 0.668508 1.3576371 -0.0000325 -0.0000182 -0.0000208 0.0645148 0.0917773 0.0708337 -0.0000068 0.1623765 -0.2464469 0.000003 -0.0000137 0.0000053 -0.079128 0.2353886 -0.0735826 0.0000029 -0.2031742 0.3706145 -0.0000122 0.0000085 -0.0000163 -0.0411172 0.0820993 -0.009342 0.0000018 -0.0629421 -0.0494516 0.000008 0.0000031 0.0000091 0.1493506 0.0562355 -0.1032182 0.0000051 -0.0249119 -0.0461298 0.0000082 0.0000028 0.0000104 0.1438815 -0.0831002 -0.0335828 0.0000062 -0.0354492 0.0993792 0.0000029 0.0000055 0.0000035 0.1641146 -0.0231289 0.0779567 -0.0000013 0.0986099 0.0104584 0.0000033 -0.0000011 0.000003 0.1304121 unknown
polarizability: 139.5437161|3.6391197|125.568615|-0.0021055|-0.0024915|39.8430855 unknown
InChI: InChI=1S/C7H4ClN3/c8-7-6-5(4-10-11-7)2-1-3-9-6/h1-4H
charge 0 multiplicity 1
15 atoms
Cl -1.974718 -2.408414 0.000067
N  0.957301 -1.485987 -0.000004
N  -1.958389 1.598632 -0.000041
N  -2.332526 0.242591 0.000027
C  0.415231 0.93766 -0.000069
C  0.039368 -0.455238 -0.000018
C  1.810376 1.256924 -0.000102
C  -0.643905 1.90747 -0.000074
C  -1.385052 -0.701987 0.000041
C  2.736408 0.212463 -0.000094
C  2.261388 -1.141738 -0.000033
H  2.128672 2.305396 -0.000143
H  -0.424782 2.981948 -0.000125
H  3.813868 0.404059 -0.000125
H  2.977158 -1.972181 -0.000006
