program: Gaussian 09
title: 000154862
version: EM64L-G09RevD.01
frameworkgroup: C1[X(C5H5Cl3O2)]
method: RPBEPBE
basis: SDD
operation: Freq
keyword: #p
keyword: freq=noraman
keyword: PBEPBE/SDD
title: #p freq=noraman PBEPBE/SDD
converged: NO YES NO NO
title: Mulliken charges:
elementType: Cl Cl Cl O O C C C C C H H H H H
charge: 0.025769 0.059403 -0.038095 -0.422085 -0.228922 0.730419 -0.792031 -0.738283 -0.388850 0.184544 0.346419 0.292191 0.318752 0.262276 0.388493
chargesum: 0.00000
title: Mulliken charges with hydrogens summed into heavy atoms:
elementType: Cl Cl Cl O O C C C C C
charge: 0.025769 0.059403 -0.038095 -0.033592 -0.228922 0.730419 -0.445612 -0.127340 -0.126574 0.184544
polarizability: 1.18031052e+02 -8.06464091e+00 8.99002900e+01 6.32060590e+00 2.46388898e+00 7.09936451e+01
1716.lowfreq: -2.8139 0.0007 0.0015 0.0023 5.6911 6.8062 37.2711 50.1521 68.6547
frequency: 37.2628 50.1441 68.6504 94.8419 137.3124 193.6902 212.0259 229.1355 259.8684 312.4371 359.0173 512.0699 535.1425 587.0213 621.4997 643.7406 692.1847 704.9509 734.5116 851.5382 902.5255 925.2899 943.9561 1054.5891 1131.5371 1183.8367 1204.8122 1243.3750 1267.1074 1288.0085 1377.4025 1444.5725 1636.1191 1645.1164 3083.4680 3141.5523 3151.7865 3172.0258 3524.3927
redmass: 14.6150 11.3049 15.0108 16.3017 9.2419 11.1709 10.8390 5.1564 3.3440 14.7952 4.9725 5.0737 8.0560 1.9089 2.3038 3.9324 6.0429 4.5282 5.0004 4.2213 1.5600 2.1646 3.5055 2.1023 1.3553 1.0743 1.1941 1.4559 1.1372 2.6745 1.7573 1.1489 8.0202 7.4993 1.0565 1.0902 1.0914 1.1116 1.0643
irintensity: 0.1426 1.1757 1.2403 0.3615 0.7360 2.6222 4.0046 0.7136 7.8515 0.7697 12.6740 79.5844 44.8406 128.7231 10.6932 3.8755 20.6943 71.3142 85.4996 8.4965 12.6214 23.3760 15.4859 399.3148 7.6573 9.1821 4.7663 15.7275 5.2614 57.1265 74.9056 32.7321 173.2575 49.7046 6.8015 1.8461 3.1589 0.4840 62.2620
temp: 298.150 k
press: 1.00000 atm
elementType: 17 17 17 8 8 6 6 6 6 6 1 1 1 1 1
symmnumber: 1
zpe: 246182.6 jmol-1
zpe.correction: 0.093766 hartree
zpe.thermalcorrener: 0.104911 hartree
zpe.thermalcorrenthalpy: 0.105856 hartree
zpe.thermalcorrgfe: 0.054151 hartree
zpe.sumelectzpe: -1723.379603 hartree
zpe.sumelectthermal: -1723.368457 hartree
zpe.sumelectthermalent: -1723.367513 hartree
zpe.sumelectthermalfe: -1723.419217 hartree
dipole: 1.2065 -2.8181 0.8602
dipole: 3.1839
quadrupole: -75.6459 -82.3070 -78.3681
quadrupole: -4.4571 3.0980 -1.8031
quadrupole: 3.1277 -3.5333 0.4056 -4.4571 3.0980 -1.8031
hfenergy: -1723.4733685 hartree
pointgroup: C01 [X(C5H5Cl3O2)]
dipole: -0.6016297 -1.0973169 -0.0553215 debye
dipolederiv: -0.4367967 0.1478342 -0.2017343 0.1445968 -0.2301194 0.1608867 -0.2013146 0.2211181 -0.5351291 -0.4676192 -0.1234786 0.2511445 -0.140047 -0.2286183 0.2150365 0.2116165 0.1412686 -0.3479688 -0.1470189 0.0282717 -0.0205884 -0.0630338 -0.4711591 0.0529726 -0.0011264 0.1475148 -0.221375 -1.0187088 -0.5236932 -0.3600978 -0.4369441 -0.6047933 -0.1375624 -0.3579979 -0.1686269 -0.5515595 -0.7727547 0.0857956 0.1028706 0.1080929 -0.6185524 -0.2801813 0.0300521 -0.2817472 -0.5254694 0.1210796 0.0002988 0.0100094 0.0910882 0.1686657 0.0885042 0.0739459 0.1215235 -0.2083265 1.0141751 -0.0156988 -0.0265315 -0.0566732 0.4468409 -0.4546507 -0.116541 -0.4257471 0.9778633 0.1053505 0.0221896 0.0295641 0.0868514 0.4161875 -0.1731629 0.116224 -0.2107823 0.2762145 -0.7733915 -0.0820366 -0.0171483 0.0571904 -0.0663948 0.0619111 0.052393 0.0338778 -0.0745396 1.9147117 0.3738492 0.1904692 0.0347577 0.846655 0.4871936 0.106443 0.4837633 0.6899842 -0.0063915 -0.0570914 -0.0395736 -0.0063561 -0.0282979 0.0075703 0.0017925 -0.0009938 -0.02955 0.0032667 -0.0355522 -0.0801858 0.0018671 0.0419696 0.068819 -0.0607594 0.0480957 0.0535592 0.0965762 0.0473652 0.0750355 -0.0049821 0.0269413 0.057342 0.0297666 0.0499391 0.0537823 0.0784336 0.0243902 0.0201248 0.0630143 0.0198173 -0.0736218 0.0113194 -0.0859388 0.1041075 0.289088 0.1075562 0.0666415 0.1205777 0.2808578 -0.0810569 0.1041865 -0.0732648 0.3384069 unknown
polarizability: 119.6638368|5.8215631|85.7814132|3.8456818|-7.1095484|73.4797375 unknown
InChI: InChI=1S/C5H5Cl3O2/c6-2-3(5(7)8)1-4(9)10/h1,5,9H,2H2
charge 0 multiplicity 1
15 atoms
Cl 2.550703 -1.392779 1.370471
Cl 2.855618 0.154321 -1.25208
Cl 0.299989 2.577523 -0.402558
O  -3.067221 -1.102294 -0.628999
O  -2.44913 0.657895 0.762566
C  0.408659 -0.182223 0.088835
C  1.691446 -0.896074 -0.237395
C  0.485382 1.13346 0.819311
C  -0.756801 -0.804192 -0.275516
C  -2.118187 -0.303904 0.028467
H  1.553217 -1.828501 -0.796222
H  1.46229 1.283445 1.297117
H  -0.349573 1.264611 1.518231
H  -0.731394 -1.748434 -0.830481
H  -3.980699 -0.763957 -0.423847
