program: Gaussian 09
title: 000154856
version: EM64L-G09RevD.01
frameworkgroup: C1[X(C5H3Br3O2)]
method: RPBEPBE
basis: SDD
operation: Freq
keyword: #p
keyword: freq=noraman
keyword: PBEPBE/SDD
title: #p freq=noraman PBEPBE/SDD
converged: NO NO NO NO
title: Mulliken charges:
elementType: Br Br Br O O C C C C C H H H
charge: 0.101507 0.092179 0.091898 -0.204895 -0.176106 0.667752 -0.359395 -0.465497 -0.931136 0.270779 0.268563 0.268574 0.375777
chargesum: 0.00000
title: Mulliken charges with hydrogens summed into heavy atoms:
elementType: Br Br Br O O C C C C C
charge: 0.101507 0.092179 0.091898 -0.204895 -0.176106 0.667752 0.177743 -0.465497 -0.555359 0.270779
polarizability: 1.49676520e+02 -9.97468192e+00 9.11809442e+01 2.15591999e-01 1.07466737e-01 9.33942161e+01
1716.lowfreq: -5.4554 0.0004 0.0005 0.0005 6.1591 8.1403 20.1856 62.4140 85.5479
frequency: 20.0411 62.3665 85.5468 124.3022 130.6774 174.1170 218.2375 237.2718 281.4195 349.9822 462.5174 513.7082 617.1654 627.2243 632.2271 678.7313 704.6855 907.2487 939.0981 958.0903 986.0147 1076.5477 1133.9531 1156.0817 1216.8521 1278.8751 1314.4824 1448.9875 1606.1532 1700.8369 3022.1675 3084.1885 3135.8678
redmass: 20.9103 19.1210 32.1288 10.1215 13.7725 23.7840 2.7949 22.2493 8.6306 10.6416 6.2737 9.8712 6.2369 5.6643 7.2652 8.4722 9.5774 7.8625 4.3305 11.0750 1.7920 7.7746 1.0704 1.0630 1.6389 1.7205 2.2206 1.0882 9.1550 13.0408 1.0570 1.1069 1.0884
irintensity: 0.7322 3.5325 0.4493 1.6567 2.4260 1.7063 11.3599 1.7053 0.9867 3.1222 30.9862 9.4365 8.7104 136.4526 47.1732 8.8553 8.8592 137.8983 13.2284 35.9049 1.7780 80.4979 0.2650 30.1983 19.0242 1.5587 4.3268 9.4005 37.0117 382.6409 7.1320 2.3576 2.6220
temp: 298.150 k
press: 1.00000 atm
elementType: 35 35 35 8 8 6 6 6 6 6 1 1 1
symmnumber: 1
zpe: 184737.3 jmol-1
zpe.correction: 0.070363 hartree
zpe.thermalcorrener: 0.080917 hartree
zpe.thermalcorrenthalpy: 0.081862 hartree
zpe.thermalcorrgfe: 0.029493 hartree
zpe.sumelectzpe: -382.392361 hartree
zpe.sumelectthermal: -382.381807 hartree
zpe.sumelectthermalent: -382.380862 hartree
zpe.sumelectthermalfe: -382.433231 hartree
dipole: -3.2083 -1.3841 0.0303
dipole: 3.4943
quadrupole: -103.1001 -85.6965 -84.2098
quadrupole: -11.7520 0.2223 0.0251
quadrupole: -12.0980 5.3056 6.7923 -11.7520 0.2223 0.0251
hfenergy: -382.462724 hartree
pointgroup: C01 [X(C5H3Br3O2)]
dipole: 1.3644144 0.1683221 -0.0016363 debye
dipolederiv: 0.0248491 0.0039141 0.0000436 0.2276574 -0.4977792 0.0009835 -0.000704 0.0017024 0.0739109 -0.3852193 0.0444621 -0.2792611 0.0725903 -0.0611491 0.1375939 -0.3088642 0.0685502 -0.6045722 -0.3836104 0.0452047 0.2780894 0.072721 -0.061924 -0.1392782 0.3083794 -0.0705858 -0.6067166 -0.6717107 0.1036737 0.0002527 0.2161845 -0.8091558 0.0011907 -0.0005686 0.0017192 -0.274295 -1.2014984 0.1313512 0.0003935 0.0042016 -0.4310851 0.0003861 0.0021467 -0.0000315 -0.3162396 -0.2253468 0.0628242 -0.0001353 -0.0051717 -0.1489884 -0.0004307 -0.0013561 -0.0000651 -0.2133438 0.2747549 -0.0178682 0.0003107 0.1040212 0.0326398 0.0006401 -0.0003078 0.0011684 0.3126258 -0.468066 -0.2590466 0.0014033 -0.7161438 0.9517053 -0.0011668 0.0024546 -0.0030784 -0.1172409 1.1128785 -0.2699251 0.0014355 -0.0112276 -0.0113858 0.0023684 0.0010142 0.0028589 1.4581868 1.8420854 0.031176 -0.0020342 0.0161123 0.8715769 -0.0017685 -0.0020488 -0.0015038 0.3465589 0.0398202 0.0243647 0.0374651 0.0277999 0.0661735 -0.029518 0.0617492 -0.0656649 0.0142512 0.0395046 0.0242481 -0.0377279 0.027426 0.0668695 0.0292562 -0.0618974 0.0651778 0.013947 0.001559 0.0756209 -0.0002353 -0.0361712 0.0325024 -0.0002567 0.0000028 -0.0002474 -0.0870724 unknown
polarizability: 139.6862976|-24.1693641|101.1673657|-0.0366614|-0.040239|93.398017 unknown
InChI: InChI=1S/C5H3Br3O2/c6-3-2(4(7)8)1-10-5(3)9/h4H,1H2
charge 0 multiplicity 1
13 atoms
Br -1.004624 2.533105 -0.005444
Br 2.847676 -0.011992 1.660752
Br 2.840599 -0.016197 -1.672092
O  -1.332181 -1.618358 0.006879
O  -3.103308 -0.083132 0.005537
C  0.463189 -0.03994 -0.000369
C  0.150534 -1.52756 0.004654
C  -0.721018 0.642901 -0.000645
C  1.826912 0.53509 -0.003863
C  -1.887106 -0.310088 0.002795
H  0.525683 -2.042647 -0.896984
H  0.527992 -2.036957 0.908547
H  1.834452 1.632377 -0.005668
