program: Gaussian 09
title: 000154848
version: EM64L-G09RevD.01
frameworkgroup: C1[X(C5H4Br2O3)]
method: RPBEPBE
basis: SDD
operation: Freq
keyword: #p
keyword: freq=noraman
keyword: PBEPBE/SDD
title: #p freq=noraman PBEPBE/SDD
converged: YES YES NO NO
title: Mulliken charges:
elementType: Br Br O O O C C C C C H H H H
charge: 0.094927 -0.000366 -0.214415 -0.404775 -0.169344 -0.179851 0.618218 -0.464724 -0.827686 0.266685 0.260328 0.327630 0.307880 0.385494
chargesum: 0.00000
title: Mulliken charges with hydrogens summed into heavy atoms:
elementType: Br Br O O O C C C C C
charge: 0.094927 -0.000366 -0.214415 -0.019282 -0.169344 0.080477 0.618218 -0.464724 -0.192176 0.266685
polarizability: 1.35711225e+02 -9.75481959e+00 9.48090193e+01 -8.56248831e-01 3.15585001e-01 5.89424207e+01
1716.lowfreq: -7.9082 -0.0005 -0.0003 -0.0002 2.7802 5.4606 32.9438 62.9741 96.4957
frequency: 32.8992 62.9672 96.4950 131.0713 150.9138 215.8002 237.5369 309.8443 339.7913 384.2445 434.7114 519.8885 561.6555 583.5734 634.7959 700.6487 733.2102 853.9972 860.3331 916.2394 942.6428 1034.9211 1088.0999 1114.3945 1172.8493 1211.5241 1252.8415 1296.8627 1390.5697 1441.3239 1638.2165 1713.0352 3019.9780 3072.2435 3163.0806 3571.6848
redmass: 14.2034 11.1121 8.7662 11.4701 8.1057 3.9897 7.4834 4.1646 1.4514 6.4073 6.1280 8.7308 4.8189 6.9296 7.1585 10.6565 6.6659 11.6596 2.0483 6.9760 2.3247 4.7799 5.5870 1.4342 1.0867 1.2029 1.6966 1.6145 1.8491 1.1317 10.1837 13.0528 1.0849 1.0565 1.1112 1.0663
irintensity: 1.2335 3.5474 2.6214 1.4939 0.2729 4.5183 0.5195 13.4525 102.0686 8.5152 64.0437 7.0663 20.3997 50.2121 12.6964 21.0598 4.7401 192.7263 28.7883 84.6232 7.0151 149.6755 57.0486 16.5896 51.2609 22.0810 3.6019 6.7361 27.8785 13.0777 36.1130 347.1668 19.8829 2.8698 1.7270 32.7156
temp: 298.150 k
press: 1.00000 atm
elementType: 35 35 8 8 8 6 6 6 6 6 1 1 1 1
symmnumber: 1
zpe: 220620.6 jmol-1
zpe.correction: 0.084030 hartree
zpe.thermalcorrener: 0.094324 hartree
zpe.thermalcorrenthalpy: 0.095269 hartree
zpe.thermalcorrgfe: 0.044872 hartree
zpe.sumelectzpe: -444.750130 hartree
zpe.sumelectthermal: -444.739836 hartree
zpe.sumelectthermalent: -444.738892 hartree
zpe.sumelectthermalfe: -444.789289 hartree
dipole: -3.2732 0.3948 1.7551
dipole: 3.7350
quadrupole: -89.9596 -67.9554 -76.6826
quadrupole: -11.5535 3.1974 0.5063
quadrupole: -11.7604 10.2438 1.5166 -11.5535 3.1974 0.5063
hfenergy: -444.8341603 hartree
pointgroup: C01 [X(C5H4Br2O3)]
dipole: 1.2990404 -0.6027334 0.3293487 debye
dipolederiv: 0.0345844 -0.0168626 -0.0168174 0.1836678 -0.4854449 -0.1747958 0.0603171 -0.1816013 0.0117698 -0.5531868 0.026368 0.1426816 -0.084264 -0.0983452 0.0156979 0.3621036 -0.023183 -0.2990252 -0.8388964 0.3801246 -0.1120126 0.226415 -1.0130334 -0.0383452 -0.0025404 -0.1147602 -0.3657019 -0.5555691 0.1576665 0.0692808 0.2410897 -0.7394588 0.3031254 -0.0761672 0.4555502 -0.4609359 -1.1402116 0.2087982 -0.0431198 0.1091695 -0.4826972 -0.0054893 -0.1011913 -0.0204551 -0.3139528 0.6835932 -0.3590535 0.0920714 -0.2249493 0.9302614 -0.251608 0.135704 -0.4043506 0.6380175 0.0254732 0.0357056 0.0367943 0.1002186 -0.341631 -0.0852635 -0.0448697 -0.0299674 -0.1587404 -0.5049342 -0.2723854 -0.0694304 -0.4944072 0.9272551 0.353681 -0.196615 0.2742865 -0.0083213 0.6710012 -0.0925627 -0.3490068 0.1314243 -0.0069555 -0.047597 -0.3605832 -0.0526776 0.4226246 1.7728761 -0.0736034 0.126442 -0.155736 1.0327037 0.0399885 0.1388037 0.2044176 0.3617369 0.0004379 0.0490697 0.0355451 0.0599707 -0.0393214 -0.0273033 0.0447484 0.0278208 -0.0811029 0.0184375 0.0243778 0.0573209 0.0208987 0.0815586 0.0628173 0.0556842 0.0428884 0.0081117 0.0275071 0.0143555 0.0920688 -0.0614413 0.0210422 -0.0526996 0.0475349 -0.0523165 -0.0048034 0.3588877 -0.0819985 -0.061818 -0.0520566 0.2140665 -0.0922084 -0.0629293 -0.1256518 0.2503233 unknown
polarizability: 123.4591545|-17.0572663|101.9874732|-16.3675498|10.3227804|64.0160371 unknown
InChI: InChI=1S/C5H4Br2O3/c6-1-2-3(7)5(9)10-4(2)8/h4,8H,1H2
charge 0 multiplicity 1
14 atoms
Br -0.608642 2.624025 0.755152
Br 3.258811 0.525152 -1.069529
O  -1.185387 -1.297463 -0.53861
O  0.622733 -2.306175 0.723938
O  -2.836806 0.352361 -0.303371
C  0.294151 -1.360628 -0.296788
C  0.678892 0.029143 0.191796
C  -0.446726 0.796819 0.224937
C  2.064323 0.34994 0.596388
C  -1.653772 0.01202 -0.208377
H  0.738308 -1.62055 -1.276967
H  2.527704 -0.468441 1.165656
H  2.156953 1.316916 1.108251
H  0.438857 -3.22882 0.412924
