program: Gaussian 09
title: 000013830
version: EM64L-G09RevD.01
frameworkgroup: C1[X(C6H16O3Si)]
method: RPBEPBE
basis: SDD
operation: Freq
keyword: #p
keyword: freq=noraman
keyword: PBEPBE/SDD
title: #p freq=noraman PBEPBE/SDD
converged: YES YES NO NO
title: Mulliken charges:
elementType: Si O O O C C C C C C H H H H H H H H H H H H H H H H
charge: 1.282962 -0.593456 -0.588456 -0.588454 -0.203813 -0.211182 -0.211185 -0.655481 -0.650241 -0.650245 -0.102417 0.206002 0.206003 0.203926 0.193629 0.193633 0.203924 0.199941 0.225830 0.225831 0.196807 0.229110 0.230708 0.196806 0.230706 0.229112
chargesum: 0.00000
title: Mulliken charges with hydrogens summed into heavy atoms:
elementType: Si O O O C C C C C C
charge: 1.180546 -0.593456 -0.588456 -0.588454 0.208191 0.186373 0.186372 -0.003880 0.006384 0.006379
polarizability: 1.13179952e+02 3.48617639e-04 1.02102381e+02 1.31155874e-04 -1.59781021e+00 8.35043638e+01
1716.lowfreq: -23.2356 -14.8970 -10.4010 -8.1414 0.0009 0.0013 0.0021 13.2570 21.4815
frequency: -18.4649 -10.0717 21.4181 27.5110 36.6524 63.2212 67.0585 118.1197 146.1158 223.8748 240.2669 240.9755 261.2872 267.2165 275.5700 369.5529 397.3917 437.5560 621.2094 672.8930 686.6137 770.0451 801.7151 805.4479 806.5475 821.4851 935.0798 948.3703 950.0283 1057.1749 1063.5973 1081.2592 1102.4649 1102.9986 1104.4749 1134.4774 1135.6666 1136.8730 1259.5630 1263.8234 1264.7852 1360.2006 1362.3454 1365.6821 1391.8419 1392.2926 1392.8335 1455.1454 1455.3147 1456.7187 1474.8905 1475.0306 1476.6539 1488.7089 1489.2968 1492.0784 2145.2056 2941.3208 2942.1287 2960.2941 2990.3896 2991.3519 2991.5711 2998.5099 2998.8954 3014.8562 3087.5985 3088.5718 3088.7688 3102.4753 3105.1650 3105.2762
redmass: 2.3755 2.4807 3.1138 1.8372 1.9932 3.3269 3.1158 4.4320 3.7155 1.4934 1.1626 1.1528 4.9232 2.4696 3.5041 3.1598 3.3471 6.7706 5.0388 2.3380 3.0695 1.5567 1.0895 1.0898 1.0962 1.2663 2.4277 2.5582 2.7637 4.4864 4.8144 5.0951 2.1650 2.1377 2.1442 1.4727 1.4651 1.4841 1.1304 1.1312 1.1276 1.2504 1.2503 1.2491 1.2585 1.2554 1.2579 1.0411 1.0411 1.0413 1.0502 1.0515 1.0470 1.0764 1.0775 1.0811 1.0426 1.0571 1.0574 1.0559 1.0362 1.0365 1.0366 1.1054 1.1053 1.1075 1.0985 1.0983 1.0983 1.1015 1.1014 1.1014
irintensity: 0.0773 0.0366 0.6010 0.1490 5.1985 3.5090 2.2792 10.9023 5.3975 3.4258 0.4555 0.0008 13.9640 19.0988 4.7145 4.2642 0.1228 36.4381 19.4847 1.7829 30.2614 179.7348 2.8966 6.6231 9.9419 210.7191 17.2455 85.9556 225.3174 538.4094 275.2415 7.4866 8.8049 4.4524 7.0310 8.4301 3.6962 8.1702 1.1521 0.3233 0.7521 9.2997 28.5776 0.0929 19.9595 29.5550 39.1437 0.1117 21.5799 10.3603 10.4249 1.9968 2.6399 17.6584 0.0000 0.0888 127.5325 47.7301 78.9706 47.0582 32.2578 37.4634 11.7431 6.9980 78.5703 37.2994 37.6423 50.0696 24.6571 41.6507 3.6326 73.0966
temp: 298.150 k
press: 1.00000 atm
elementType: 14 8 8 8 6 6 6 6 6 6 1 1 1 1 1 1 1 1 1 1 1 1 1 1 1 1
symmnumber: 1
zpe: 567040.7 jmol-1
zpe.correction: 0.215974 hartree
zpe.thermalcorrener: 0.229523 hartree
zpe.thermalcorrenthalpy: 0.230468 hartree
zpe.thermalcorrgfe: 0.172713 hartree
zpe.sumelectzpe: -752.490692 hartree
zpe.sumelectthermal: -752.477143 hartree
zpe.sumelectthermalent: -752.476198 hartree
zpe.sumelectthermalfe: -752.533952 hartree
dipole: -0.0001 1.0246 0.5082
dipole: 1.1437
quadrupole: -58.5527 -70.0311 -70.6671
quadrupole: 0.0015 0.0007 -6.0718
quadrupole: 7.8642 -3.6141 -4.2501 0.0015 0.0007 -6.0718
hfenergy: -752.7066659 hartree
pointgroup: C01 [X(C6H16O3Si1)]
dipole: 0.0001472 0.394228 0.2169465 debye
dipolederiv: 2.4952932 -0.0001173 -0.0000729 -0.0001138 2.2103266 -0.2385318 0.0000167 0.0921342 1.3642725 -0.7549287 -0.0002138 0.0000912 -0.0002292 -1.6075882 0.3745767 0.0001205 0.4855688 -0.7634707 -1.7886085 0.3311487 0.0654096 0.2514999 -0.7357367 0.0334778 0.1458974 -0.0349952 -0.5490315 -1.7889159 -0.3304864 -0.0653658 -0.2508326 -0.7353922 0.0335257 -0.1458794 -0.0348989 -0.5490151 0.3953359 0.0001133 -0.0000609 0.0001149 0.8296974 -0.2399356 -0.0001424 -0.5541019 0.5172897 1.2055799 -0.2191299 -0.0247385 -0.0202598 0.3412099 -0.0488216 0.179348 -0.1027966 0.3205991 1.2056826 0.2185907 0.0246814 0.0197308 0.3410819 -0.0488419 -0.1794471 -0.1027018 0.3205849 0.0518716 -0.0000501 -0.0000053 -0.000052 -0.1803846 -0.0277507 -0.0000015 -0.013747 0.0482764 -0.0734667 0.0994982 0.0730503 0.0862467 -0.0264624 -0.0555719 0.0587339 -0.053451 0.0046693 -0.0735854 -0.0994534 -0.0731005 -0.0862006 -0.026315 -0.0555244 -0.0587866 -0.0534131 0.0046505 -0.3551116 0.0000239 0.0000059 0.0000223 -0.2831991 0.0315624 0.0000009 0.014398 -0.3152302 -0.0935711 0.0191228 0.1398562 0.0495919 -0.0232912 -0.0151997 0.0982652 0.0537801 -0.0636507 -0.0935867 -0.0190946 -0.1398616 -0.0495589 -0.0232601 -0.015141 -0.0982383 0.0538197 -0.0636607 -0.0971003 -0.0354941 0.0072528 -0.1160132 -0.1756105 0.0034959 -0.0061623 0.0327927 0.0534693 -0.0628198 0.0247966 0.0150672 0.0159343 0.0493405 0.0406422 -0.089025 0.0418818 -0.2070401 -0.062845 -0.0247259 -0.0150459 -0.0158768 0.0493496 0.0407061 0.0890444 0.0418869 -0.2070279 -0.096995 0.0354411 -0.0072339 0.1159571 -0.1757189 0.0034449 0.0062141 0.0327382 0.053472 0.1104933 -0.0000439 0.0000301 -0.0000438 -0.0656772 0.1145113 0.000039 0.1517473 -0.071875 -0.0689315 0.0553271 0.1125946 0.0175134 0.082378 -0.0191339 0.1092547 -0.0679995 0.0260155 -0.0689529 -0.0552569 -0.1126073 -0.0174446 0.0824088 -0.0190847 -0.1092905 -0.0679538 0.0260053 -0.1990463 0.0235387 -0.045608 -0.0022504 0.0875487 -0.0241987 -0.0637909 -0.0205451 0.0774105 0.0913429 -0.0956899 0.0143062 -0.0407906 -0.1245563 0.0178843 0.0327751 0.0332995 0.082305 0.1152508 0.0032526 -0.036155 0.0147302 0.0734715 0.0601313 0.0107137 0.029908 -0.1343756 -0.1990533 -0.0233644 0.0455999 0.0024229 0.0875718 -0.0242254 0.0637902 -0.0205833 0.0773967 0.1152381 -0.0032851 0.0361837 -0.014753 0.0734635 0.0601555 -0.0107065 0.0299621 -0.1343591 0.0914303 0.095552 -0.0142735 0.040655 -0.1246555 0.017847 -0.0327433 0.0332699 0.08232 unknown
polarizability: 113.1799505|-0.0045167|102.2047455|-0.0001576|-0.7992335|83.402001 unknown
InChI: InChI=1S/C6H16O3Si/c1-4-7-10(8-5-2)9-6-3/h10H,4-6H2,1-3H3
charge 0 multiplicity 1
26 atoms
Si -0.000001 -0.205156 0.697378
O  0.000463 1.514474 0.69335
O  1.333126 -0.874829 -0.148539
O  -1.333535 -0.874044 -0.148527
C  0.000685 2.38792 -0.491635
C  2.736842 -0.777726 0.276585
C  -2.737173 -0.776102 0.276668
C  0.000997 3.837535 -0.006847
C  3.546963 -1.765333 -0.563058
C  -3.547975 -1.762989 -0.563164
H  -0.00008 -0.536777 2.161415
H  0.897532 2.175705 -1.108629
H  -0.896227 2.176105 -1.108674
H  3.100762 0.258876 0.122333
H  2.829482 -1.015779 1.35848
H  -2.829926 -1.014333 1.358514
H  -3.100413 0.260776 0.122661
H  0.001174 4.533105 -0.86702
H  -0.893094 4.037427 0.608448
H  0.895148 4.037026 0.608491
H  4.618295 -1.717369 -0.291342
H  3.18487 -2.794879 -0.401507
H  3.443382 -1.527828 -1.635587
H  -4.619265 -1.714384 -0.291395
H  -3.44428 -1.525314 -1.635644
H  -3.18655 -2.792807 -0.401855
