program: Gaussian 09
title: 000154839
version: EM64L-G09RevD.01
frameworkgroup: C1[X(C9H5F2N)]
method: RPBEPBE
basis: SDD
operation: Freq
keyword: #pfreq=noraman
keyword: PBEPBE/SDD
title: #p freq=noraman PBEPBE/SDD
converged: NO NO NO YES
title: Mulliken charges:
elementType: F F N C C C C C C C C C H H H H H
charge: -0.198950 -0.187186 -0.017240 0.237481 -0.007108 0.217953 -0.390943 -0.316203 -0.388510 -0.175954 0.340860 -0.446355 0.296651 0.267655 0.261283 0.240582 0.265984
chargesum: 0.00000
title: Mulliken charges with hydrogens summed into heavy atoms:
elementType: F F N C C C C C C C C C
charge: -0.198950 -0.187186 -0.017240 0.237481 -0.007108 0.217953 -0.094292 -0.048548 -0.127227 0.064628 0.340860 -0.180371
polarizability: 1.57961082e+02 -1.52950687e+00 1.07671383e+02 -3.83543018e-04 -6.98557520e-04 4.02359475e+01
1716.lowfreq: -0.0009 -0.0006 0.0003 5.9596 9.1664 10.0378 103.9209 165.5952 210.4613
frequency: 103.9156 165.5903 210.4606 224.4876 327.6879 351.9181 414.9945 427.4371 483.3244 511.2406 512.5110 526.6186 558.5778 658.4756 672.3364 702.4088 752.9758 818.6660 850.9257 897.7261 906.1927 912.5551 919.0672 982.1826 1006.9520 1054.3749 1140.9096 1174.5196 1213.5269 1228.2898 1238.3500 1334.1739 1361.4038 1374.9530 1422.3812 1456.8932 1492.0181 1549.6980 1601.4875 1633.0664 3145.8616 3151.2067 3174.9035 3183.3794 3184.8354
redmass: 7.8796 5.1133 13.3634 4.9654 5.6105 8.8071 8.9693 4.6310 5.6139 3.7180 8.6226 7.4077 3.5044 4.4270 10.0478 6.9291 1.7573 2.3020 4.4916 1.4978 1.4210 1.4245 6.7579 1.3219 3.6137 1.8812 1.6210 1.5259 3.1710 1.8485 2.3556 2.0881 5.2391 2.7773 4.3932 3.2136 5.1542 7.4218 7.1115 7.8750 1.0923 1.0879 1.0928 1.0939 1.0988
irintensity: 1.0497 0.0033 1.4064 1.4472 7.2353 5.0544 2.9988 0.0109 6.9346 0.2806 13.6303 0.5959 5.0357 4.0944 2.1377 11.3750 23.0306 58.3113 3.1631 23.4297 18.8496 6.4049 25.3330 2.6512 42.9640 10.0739 46.3951 31.7609 26.3703 2.2607 47.1379 15.4961 29.9893 26.7377 16.2838 54.6539 23.0378 11.7657 65.6257 3.2009 8.5854 6.0388 3.2887 3.3923 5.5422
temp: 298.150 k
press: 1.00000 atm
elementType: 9 9 7 6 6 6 6 6 6 6 6 6 1 1 1 1 1
symmnumber: 1
zpe: 305140.2 jmol-1
zpe.correction: 0.116222 hartree
zpe.thermalcorrener: 0.124899 hartree
zpe.thermalcorrenthalpy: 0.125843 hartree
zpe.thermalcorrgfe: 0.082286 hartree
zpe.sumelectzpe: -599.568796 hartree
zpe.sumelectthermal: -599.560119 hartree
zpe.sumelectthermalent: -599.559175 hartree
zpe.sumelectthermalfe: -599.602732 hartree
dipole: 2.0030 -0.4550 0.0000
dipole: 2.0541
quadrupole: -61.5872 -70.5506 -69.4332
quadrupole: -1.9727 0.0000 0.0000
quadrupole: 5.6032 -3.3603 -2.2429 -1.9727 0.0000 0.0000
hfenergy: -599.6850177 hartree
pointgroup: C01 [X(C9H5F2N1)]
dipole: -0.7885404 0.176863 0.0000031 debye
dipolederiv: -0.2239342 -0.0147066 0. -0.1743959 -1.0567833 -0.0000138 0.0000009 -0.0000029 -0.1375298 -1.1220279 0.2880673 0.0000053 0.4731847 -0.3339942 -0.0000028 0.0000122 -0.0000031 -0.1476062 -0.222268 0.0748501 0.0000055 0.040559 -0.2793072 0.0000005 0.0000015 0.0000005 -0.2419498 0.0301984 -0.2241441 -0.0000021 0.1582921 -0.2650933 -0.0000038 -0.0000002 -0.0000075 0.0243449 0.257003 0.0123093 0.0000001 -0.227434 0.0113092 -0.0000012 -0.0000081 -0.000001 0.0700411 0.2298272 0.0844952 0.0000023 0.1951912 1.1727174 0.0000155 -0.0000028 0.0000024 0.0711473 -0.1334382 0.1603576 0.000007 -0.1196604 0.035111 0.0000031 0.0000093 0.0000083 -0.1128712 -0.1470113 0.0026645 -0.0000006 -0.036375 0.0895326 0.0000032 -0.0000004 0.0000073 -0.153942 -0.078814 0.1890632 -0.0000007 0.0328384 -0.1168859 0.0000038 0.0000031 0.0000047 -0.1506297 0.077355 -0.105233 -0.0000035 -0.0474273 0.086555 0.0000023 0.0000053 0.0000035 -0.1496918 1.1342173 -0.41206 -0.0000107 -0.6566634 0.2208352 0.0000011 -0.000019 0.0000032 0.1414969 0.0816477 0.0175434 -0.0000028 0.3528866 0.2467081 0.000003 0.0000008 0.0000008 -0.0498693 0.1087567 -0.0094962 -0.0000008 0.0336533 0.0397641 -0.0000024 -0.0000023 -0.0000059 0.1799518 0.0969003 -0.0219309 0.0000004 0.0281085 -0.0314436 -0.0000031 0.0000034 -0.000005 0.1683615 0.0087931 -0.0718322 -0.0000006 -0.0651222 0.0595809 -0.0000024 -0.0000015 -0.0000042 0.1847485 -0.0551655 0.0810185 0.0000014 0.0752695 0.0476289 -0.0000023 -0.000004 -0.0000012 0.1618128 -0.0420394 -0.0509663 0. -0.0629052 0.0737652 -0.0000006 0.0000018 0. 0.1421849 unknown
polarizability: 157.9691023|-1.3913924|107.6633627|0.0003816|0.0006996|40.2359475 unknown
InChI: InChI=1S/C9H5F2N/c10-6-4-7-8(11)2-1-3-9(7)12-5-6/h1-5H
charge 0 multiplicity 1
17 atoms
F  -1.416944 -2.496492 -0.000047
F  3.495443 -0.894137 -0.000012
N  0.978297 1.786248 0.000017
C  -0.17483 -0.415443 -0.000028
C  -0.194776 1.038257 -0.000011
C  -1.434083 -1.086827 -0.000039
C  1.086742 -1.090109 0.000003
C  -1.449164 1.729319 0.000004
C  -2.650936 -0.419754 -0.000024
C  -2.647909 1.011928 0.000007
C  2.225217 -0.29697 0.000006
C  2.151577 1.13041 0.000016
H  1.147235 -2.181429 -0.000014
H  -1.426834 2.822355 0.000024
H  -3.585936 -0.987233 -0.000032
H  -3.605717 1.541906 0.000017
H  3.073217 1.723472 0.000012
