program: Gaussian 09
title: 000013827
version: EM64L-G09RevD.01
frameworkgroup: C1[X(C4H9NO2S)]
method: RPBEPBE
basis: SDD
operation: Freq
keyword: #p
keyword: freq=noraman
keyword: PBEPBE/SDD
title: #p freq=noraman PBEPBE/SDD
converged: YES YES NO NO
title: Mulliken charges:
elementType: S O O N C C C C H H H H H H H H H
charge: 0.013485 -0.421671 -0.207910 -0.575582 -0.332751 -0.570743 -0.365137 0.233220 0.243943 0.223581 0.309396 0.228607 0.200032 0.280311 0.261791 0.097051 0.382377
chargesum: 0.00000
title: Mulliken charges with hydrogens summed into heavy atoms:
elementType: S O O N C C C C
charge: 0.110536 -0.039294 -0.207910 -0.033481 0.134774 -0.261347 0.063501 0.233220
polarizability: 7.55848933e+01 -5.45656229e-01 7.97343082e+01 7.66068412e+00 -3.10686416e+00 6.27680031e+01
1716.lowfreq: -13.4630 -12.5734 -4.4558 -0.0014 -0.0009 0.0004 38.7650 75.5308 98.9864
frequency: 38.6469 75.5211 98.9541 151.7695 190.0053 232.8191 266.5965 284.5802 319.8528 374.7366 473.0812 543.5113 585.0519 610.5026 657.4108 743.0956 769.4648 819.9481 890.1716 935.8211 1025.8677 1044.6152 1071.1830 1111.9500 1126.0180 1195.7549 1218.1627 1261.1148 1295.9559 1311.4019 1337.1685 1391.4464 1453.5227 1488.4047 1642.4850 1667.0465 2424.3454 2877.1420 2989.6675 3040.4307 3042.7363 3064.4025 3468.6798 3518.8830 3596.4317
redmass: 9.2249 4.5447 1.9720 4.1624 7.6062 1.2132 1.0757 2.7756 2.8449 8.6103 3.3712 4.0367 1.2823 1.4033 3.0368 4.4223 1.5993 1.5012 1.7062 1.6486 2.5403 1.7921 3.5337 2.9678 1.2014 1.2556 1.3712 1.4345 1.1624 1.5986 1.4780 1.4668 1.0797 1.0843 1.0949 9.2189 1.0379 1.0715 1.0617 1.0873 1.0849 1.1009 1.0451 1.0642 1.0980
irintensity: 0.8336 0.5578 3.1174 1.9541 1.2718 31.9112 39.9973 2.2649 11.2713 3.4331 8.6325 56.5420 235.5410 143.3886 33.9514 12.8072 3.2330 27.0573 4.9338 13.3135 190.4136 95.2297 11.3957 24.5822 1.5726 4.8800 3.0111 1.1714 7.0122 12.8609 15.8521 11.8445 8.6240 4.0398 38.1511 193.8826 30.0759 105.4084 17.5242 0.9974 17.9806 29.9666 0.6953 28.5900 1.5655
temp: 298.150 k
press: 1.00000 atm
elementType: 16 8 8 7 6 6 6 6 1 1 1 1 1 1 1 1 1
symmnumber: 1
zpe: 345280.3 jmol-1
zpe.correction: 0.131510 hartree
zpe.thermalcorrener: 0.141575 hartree
zpe.thermalcorrenthalpy: 0.142520 hartree
zpe.thermalcorrgfe: 0.095368 hartree
zpe.sumelectzpe: -760.414707 hartree
zpe.sumelectthermal: -760.404642 hartree
zpe.sumelectthermalent: -760.403698 hartree
zpe.sumelectthermalfe: -760.450849 hartree
dipole: 2.0356 -1.8733 1.4761
dipole: 3.1356
quadrupole: -57.9319 -48.6335 -57.3587
quadrupole: 0.6588 -7.3004 2.7285
quadrupole: -3.2905 6.0079 -2.7174 0.6588 -7.3004 2.7285
hfenergy: -760.5462174 hartree
pointgroup: C01 [X(C4H9N1O2S1)]
dipole: -0.6731832 -0.8372308 -0.6063921 debye
dipolederiv: -0.1293489 -0.1210092 0.1861841 -0.1311481 -0.1686814 -0.0960937 0.1664351 -0.079928 0.0631279 -0.405171 0.0741884 0.1191897 0.0919791 -1.094551 -0.4178847 0.1433697 -0.3250744 -0.4857988 -0.5954731 -0.0142749 -0.2759037 0.142605 -0.5864615 0.0204567 -0.3122589 -0.1963287 -0.6992767 -0.8483945 0.0171886 -0.1072155 0.0478485 -0.39799 0.2166942 -0.1628523 0.2270455 -0.4124887 0.1274559 -0.043088 0.0409072 -0.002367 -0.0575159 0.0412892 0.0604229 -0.0357879 -0.0012688 -0.1007539 0.1742133 -0.1086016 0.17517 0.3494505 0.1434012 -0.1596958 0.2593591 -0.0305654 0.6243998 -0.007761 0.0738572 0.0148178 0.2770751 -0.0708113 0.001296 -0.1272218 0.1684549 0.7152089 -0.2679139 0.3354546 -0.3560194 1.2980867 0.3428068 0.3818399 0.278156 0.9170101 0.018618 0.0705001 -0.0640884 0.0512929 -0.0107148 0.1035559 -0.0105296 0.0961842 0.0051207 0.0375082 -0.0727595 -0.0030938 -0.0422719 -0.081439 -0.1201766 0.0161293 -0.0765755 0.0212919 0.0377316 -0.0069848 0.0415359 0.0091343 -0.032438 -0.0391625 0.0637857 -0.0431332 -0.0479768 0.0528353 0.0116848 -0.016244 0.0282896 -0.044326 -0.1131145 -0.0188053 -0.075919 0.0235142 -0.2097097 0.079181 -0.1053808 0.1304345 -0.064619 0.1167471 -0.0883239 0.0879993 -0.0456651 0.1614219 -0.0723024 0.073488 -0.1560346 0.2517881 -0.0306055 0.1648252 -0.0565206 0.0822726 0.1716951 0.0019503 0.0588181 -0.0721792 0.0454842 -0.130768 0.0475688 -0.0960353 0.2664901 0.0515265 0.1052325 -0.1360598 0.0361768 0.0238142 -0.0050912 -0.1473179 0.0796427 -0.0548845 0.2904499 0.0719546 -0.1128472 0.0322718 0.2930378 0.038757 -0.1458888 0.0841377 0.2306425 unknown
polarizability: 75.7969762|-0.4132314|79.3592884|6.7386589|5.1569871|62.93094 unknown
InChI: InChI=1S/C4H9NO2S/c5-2-1-3(8)4(6)7/h3,6,8H,1-2,5H2
charge 0 multiplicity 1
17 atoms
S  0.726585 2.234334 0.165346
O  1.342528 -1.685326 -0.653876
O  1.972168 -0.307243 1.108173
N  -3.090042 -0.487679 0.333603
C  -0.990802 0.118004 -0.810811
C  0.4928 0.555185 -0.705611
C  -1.681929 -0.111772 0.548844
C  1.342513 -0.463557 0.043376
H  -1.561726 0.879991 -1.372394
H  -1.019045 -0.818131 -1.404005
H  0.910042 0.650523 -1.723423
H  -1.652643 0.829157 1.127427
H  -1.09608 -0.863515 1.132702
H  -3.69927 -0.358648 1.145269
H  -3.223721 -1.400995 -0.110658
H  -0.027213 2.917878 -0.778917
H  1.905335 -2.340104 -0.158446
