program: Gaussian 09
title: 000154831
version: EM64L-G09RevD.01
frameworkgroup: C1[X(C15H17NO3)]
method: RPBEPBE
basis: SDD
operation: Freq
keyword: #p
keyword: freq=noraman
keyword: PBEPBE/SDD
title: #p freq=noraman PBEPBE/SDD
converged: YES YES NO NO
title: Mulliken charges:
elementType: O O O N C C C C C C C C C C C C C C C H H H H H H H H H H H H H H H H H
charge: -0.284846 -0.477645 -0.275382 -0.373080 -0.119868 -0.300216 -0.349527 0.134963 0.265624 0.436240 -0.385942 -0.369142 -0.454373 -0.421946 -0.241094 -0.236150 -0.238007 0.255677 -0.773422 0.220639 0.235206 0.199536 0.236183 0.266453 0.246228 0.324741 0.262460 0.237067 0.237082 0.222990 0.350639 0.227835 0.226428 0.251972 0.252672 0.210004
chargesum: 0.00000
title: Mulliken charges with hydrogens summed into heavy atoms:
elementType: O O O N C C C C C C C C C C C C C C C
charge: -0.284846 -0.127005 -0.275382 -0.048340 0.100771 0.134527 0.153109 0.134963 0.265624 0.436240 -0.139714 -0.106682 -0.217306 -0.184864 -0.018104 -0.008315 -0.011579 0.255677 -0.058774
polarizability: 2.14226638e+02 -3.18442134e+01 1.82976661e+02 1.26516319e+01 2.82474981e+01 1.46109779e+02
1716.lowfreq: -11.7761 -3.5303 0.0000 0.0003 0.0005 6.1050 8.0278 18.8559 42.3960
frequency: 7.3955 18.6832 42.3881 51.4418 82.0667 88.4958 114.4085 118.8363 146.5210 180.7940 211.0148 228.7750 249.3339 252.6842 262.4131 268.0022 377.6973 400.4137 408.0779 418.2269 467.0949 471.5782 504.2917 531.2523 570.0471 572.3944 593.3532 608.3926 626.6330 641.4293 661.5929 715.0423 740.6651 781.9409 783.4555 806.6408 847.0547 858.1979 867.8324 872.0763 891.7900 929.1387 960.9409 962.3722 973.6443 974.6315 994.2172 1007.9312 1023.0209 1040.8177 1062.0797 1064.8411 1088.6607 1098.5260 1120.3926 1147.8637 1171.4218 1172.7583 1185.9136 1195.4727 1232.1136 1238.4478 1251.4342 1259.4208 1268.5302 1301.3616 1350.3666 1368.6073 1380.3790 1385.0831 1386.5088 1405.1303 1427.9621 1440.2298 1450.8979 1453.0867 1465.5877 1467.7087 1473.2774 1485.6206 1517.5782 1584.7253 1597.7748 1619.4956 1636.8662 2950.2463 2986.3824 2994.9643 3001.2554 3029.2027 3082.2671 3095.8379 3100.5277 3122.3172 3128.6131 3137.0409 3149.0688 3155.6296 3167.9540 3175.0645 3552.9473 3581.0798
redmass: 5.3769 6.0759 5.2532 4.2231 5.2693 1.1664 2.7794 3.8071 4.6249 4.1004 3.2596 4.1836 5.4829 2.2489 3.9854 1.3848 3.6007 3.0404 2.8306 3.0887 5.1350 3.2963 6.7220 5.5223 2.7622 3.1202 4.2749 6.5378 2.9936 3.2294 1.2661 6.3234 1.3253 1.6603 4.8357 1.9110 3.6328 2.2160 1.8221 2.5615 1.6383 3.4097 1.3470 6.0995 1.5757 1.5567 1.3335 1.7084 2.5329 1.6460 2.8535 2.9548 2.3503 2.0366 2.0566 1.4291 1.0930 1.2400 1.2852 1.2011 1.7512 2.0261 1.3064 1.7611 1.8167 1.2475 1.4026 1.6244 1.7848 1.3548 1.5582 3.2061 5.3071 2.5272 1.0476 2.2428 1.1261 1.0886 1.1441 1.9410 3.8926 7.0466 5.6402 6.8364 6.9931 1.0587 1.0728 1.0360 1.0795 1.1031 1.0963 1.0994 1.0993 1.0860 1.0860 1.0902 1.0936 1.0961 1.0966 1.0973 1.0775 1.0667
irintensity: 0.7574 1.8563 5.3266 2.7151 2.3861 1.6383 1.8398 13.2961 8.0906 0.7871 6.7273 5.2931 2.8698 30.2240 9.9024 135.1650 1.4388 4.4479 13.6853 6.4206 3.1690 0.0282 1.0673 0.3915 49.6677 11.8950 2.5679 6.0479 21.5316 1.3309 107.1518 13.0865 1.5463 89.2018 4.7148 66.3674 2.6553 0.7365 0.3743 3.5584 3.9775 38.1987 0.2120 21.2772 0.3075 7.5599 0.0337 1.6810 24.1468 15.9342 11.1902 127.7470 76.5302 50.0135 16.0576 6.5459 2.7176 28.7396 18.9540 2.9551 56.6491 140.8031 1.6957 76.2709 36.2272 6.0363 2.3608 28.1583 2.1729 73.5321 11.5966 23.2148 23.4618 5.8828 15.1094 43.3843 79.8313 17.4000 6.0540 181.3134 27.1383 68.5744 6.2532 182.6479 3.8708 46.7118 13.0638 11.7845 52.0108 48.4274 9.0837 16.2636 15.1345 1.2962 1.1111 14.9923 30.8386 34.7965 20.0528 13.3328 34.7989 12.4873
temp: 298.150 k
press: 1.00000 atm
elementType: 8 8 8 7 6 6 6 6 6 6 6 6 6 6 6 6 6 6 6 1 1 1 1 1 1 1 1 1 1 1 1 1 1 1 1 1
symmnumber: 1
zpe: 761863.7 jmol-1
zpe.correction: 0.290179 hartree
zpe.thermalcorrener: 0.308422 hartree
zpe.thermalcorrenthalpy: 0.309366 hartree
zpe.thermalcorrgfe: 0.240465 hartree
zpe.sumelectzpe: -860.834866 hartree
zpe.sumelectthermal: -860.816623 hartree
zpe.sumelectthermalent: -860.815679 hartree
zpe.sumelectthermalfe: -860.884580 hartree
dipole: -1.1625 4.3953 -2.0035
dipole: 4.9683
quadrupole: -98.5450 -109.8158 -107.1547
quadrupole: -12.2936 4.8308 6.5187
quadrupole: 6.6269 -4.6440 -1.9829 -12.2936 4.8308 6.5187
hfenergy: -861.1250449 hartree
pointgroup: C01 [X(C15H17N1O3)]
dipole: -0.8595471 1.7403969 -0.2301658 debye
polarizability: 222.5199637|-16.2996786|158.0213279|-12.9768233|37.5298043|162.7717854 unknown
InChI: InChI=1S/C15H17NO3/c1-11(17)16-9-13(18)10-19-15-8-4-6-12-5-2-3-7-14(12)15/h2-8,13,16,18H,9-10H2,1H3
charge 0 multiplicity 1
36 atoms
O  -0.383795 0.518325 -0.639937
O  -4.01993 1.215327 -0.772099
O  -2.419175 -2.907935 1.355104
N  -3.680489 -1.079967 0.655693
C  -2.753563 0.488607 -1.012635
C  -1.636642 1.107441 -0.155287
C  -3.0528 -0.977459 -0.665225
C  2.008304 0.322958 -0.569452
C  0.81535 0.933167 -0.034346
C  3.286648 0.709088 -0.011254
C  0.885028 1.869681 1.003717
C  1.962251 -0.644583 -1.623655
C  3.335419 1.674183 1.050668
C  4.475904 0.107231 -0.540818
C  2.158272 2.235138 1.543117
C  3.140741 -1.212762 -2.115859
C  4.407825 -0.833271 -1.571459
C  -3.329746 -2.053073 1.579315
C  -4.118394 -2.025933 2.887489
H  -2.455155 0.551606 -2.079143
H  -1.7937 0.873826 0.916288
H  -1.611218 2.21035 -0.287662
H  -3.716368 -1.398349 -1.445487
H  -2.120727 -1.567792 -0.645252
H  -0.018262 2.326607 1.417432
H  -4.439139 -0.423252 0.849799
H  0.988649 -0.932948 -2.029149
H  4.307397 1.959401 1.468369
H  5.44505 0.398177 -0.11825
H  2.19528 2.967888 2.356636
H  -3.968934 2.12583 -1.155669
H  3.097122 -1.955622 -2.919813
H  5.324594 -1.28635 -1.96488
H  -4.668939 -2.97668 2.995669
H  -3.410624 -1.962182 3.731543
H  -4.835133 -1.188973 2.953994
