program: Gaussian 09
title: 000154829
version: EM64L-G09RevD.01
frameworkgroup: C1[X(C20H16O)]
method: RPBEPBE
basis: SDD
operation: Freq
keyword: #pfreq=noraman
keyword: PBEPBE/SDD
title: #p freq=noraman PBEPBE/SDD
converged: YES YES NO NO
title: Mulliken charges:
elementType: O C C C C C C C C C C C C C C C C C C C C H H H H H H H H H H H H H H H H
charge: -0.246717 0.079861 0.294764 0.254064 -0.507170 -0.523253 -0.438283 -0.414971 0.066908 -0.676603 0.081532 -0.002539 0.152755 0.084447 0.088979 -0.376707 -0.410611 -0.404279 -0.407248 -0.288235 -0.250577 0.203876 0.240488 0.223312 0.228670 0.209787 0.206834 0.214346 0.205084 0.260063 0.262672 0.267796 0.313930 0.261770 0.257423 0.244422 0.243411
chargesum: 0.00000
title: Mulliken charges with hydrogens summed into heavy atoms:
elementType: O C C C C C C C C C C C C C C C C C C C C
charge: -0.246717 0.079861 0.294764 0.254064 -0.062805 -0.071271 -0.021662 0.004459 0.066908 -0.153868 0.081532 -0.002539 0.152755 0.084447 0.088979 -0.108910 -0.096681 -0.142510 -0.149825 -0.043813 -0.007166
polarizability: 3.36688172e+02 1.91603234e+01 3.04245037e+02 -8.61155291e+00 -5.88762980e+00 1.02981057e+02
1716.lowfreq: -10.5959 -7.6770 -4.3417 0.0003 0.0006 0.0007 36.0337 56.4757 92.7140
frequency: 36.0059 56.4006 92.7123 109.1885 135.0394 153.3548 177.5575 205.4573 256.4891 264.4153 287.0526 293.9690 307.9833 330.8659 349.7541 386.6938 414.2051 450.3176 472.0185 477.4395 503.4488 517.1631 541.5598 564.4505 588.5075 602.1545 659.2067 674.6670 684.2178 739.7505 752.0548 761.2718 761.8218 783.6013 815.9477 824.1868 829.9406 865.9714 869.7983 880.1285 895.5729 905.3504 912.2295 924.8203 928.7699 932.3964 956.9649 973.5781 1001.1465 1014.4555 1053.2660 1075.5227 1085.7557 1103.0890 1108.7449 1114.6119 1118.7256 1143.2980 1155.9780 1168.2089 1178.2614 1181.9872 1226.7374 1246.0657 1254.7181 1271.4302 1278.7369 1306.4837 1310.9657 1315.8747 1333.3871 1337.4808 1342.7861 1356.3753 1363.2457 1392.2381 1398.8994 1433.9119 1448.4827 1460.4262 1467.3296 1471.6366 1477.7221 1493.4260 1535.5735 1544.2948 1566.6410 1621.5913 1698.3980 2935.9885 2940.5301 2952.4526 2977.2570 2980.2823 2994.9029 3020.2206 3028.0298 3040.8636 3049.8184 3180.7165 3183.1875 3210.6457 3213.6409 3232.6560 3236.0163
redmass: 4.0058 3.7312 4.8629 3.1938 2.6160 3.1343 4.1345 3.3110 4.1039 3.8110 4.6688 3.3608 3.3411 2.7436 4.7617 4.3787 6.1073 2.7333 3.8488 4.9009 3.5102 2.8077 4.6186 2.7471 4.1493 4.0048 2.8094 2.6308 2.6254 1.9029 4.7480 1.7754 4.1515 6.3440 2.9403 2.0220 3.2887 3.0232 1.8304 1.4800 1.9936 3.5053 2.2278 1.7189 1.4942 1.4503 2.5683 2.0754 2.3824 2.0313 2.2694 1.8485 1.9888 1.5133 1.5555 1.7701 1.3678 2.0376 1.9161 1.3905 1.7996 1.8845 1.9321 1.4119 1.7715 1.2603 5.5589 4.0347 1.9217 1.8831 1.6720 1.8713 1.5317 1.5788 2.6484 1.3096 3.3991 4.4476 1.2325 6.7661 1.1044 1.1027 1.1023 7.7651 5.0905 7.8770 7.2172 6.7404 11.0121 1.0656 1.0662 1.0647 1.0722 1.0621 1.0846 1.0881 1.0939 1.0990 1.1039 1.0888 1.0890 1.1036 1.1030 1.0994 1.0981
irintensity: 0.1330 4.0357 2.0559 0.4875 4.3620 0.4035 1.0237 1.2608 0.8595 1.5084 3.9929 0.6078 1.7996 0.9674 3.1740 4.3238 5.5385 0.7785 1.2896 6.4160 2.3728 3.8179 0.8682 0.3426 11.0850 2.9949 2.5327 5.7507 11.0329 2.2254 11.5895 126.6616 34.2558 14.4489 20.0349 0.0648 0.9102 2.5014 6.6131 7.0699 6.1178 0.6191 3.8798 5.3558 1.7793 1.2116 1.3107 2.6930 3.8968 7.1286 26.8683 3.2923 3.5587 2.4719 8.1972 1.5346 7.1674 7.4182 16.0784 5.8975 7.8252 9.9341 27.6118 0.8155 14.4373 3.0474 74.0627 10.1854 22.2384 37.5954 4.0252 27.0568 5.4685 1.0675 4.8104 88.2152 39.5964 35.1783 14.1804 54.0054 9.7898 12.5163 5.6153 3.7022 1.7190 241.5086 35.8821 127.9782 4.6218 5.6479 31.5166 22.8547 19.7539 34.9550 59.2470 5.9742 18.1503 75.1919 59.4184 22.7004 5.7090 9.5159 13.4735 0.5946 5.1249
temp: 298.150 k
press: 1.00000 atm
elementType: 8 6 6 6 6 6 6 6 6 6 6 6 6 6 6 6 6 6 6 6 6 1 1 1 1 1 1 1 1 1 1 1 1 1 1 1 1
symmnumber: 1
zpe: 774830.7 jmol-1
zpe.correction: 0.295117 hartree
zpe.thermalcorrener: 0.311201 hartree
zpe.thermalcorrenthalpy: 0.312146 hartree
zpe.thermalcorrgfe: 0.251986 hartree
zpe.sumelectzpe: -845.461441 hartree
zpe.sumelectthermal: -845.445357 hartree
zpe.sumelectthermalent: -845.444413 hartree
zpe.sumelectthermalfe: -845.504572 hartree
dipole: 1.9869 3.8136 -0.4336
dipole: 4.3220
quadrupole: -100.3350 -123.4148 -125.5351
quadrupole: -3.9096 -0.8703 0.4231
quadrupole: 16.0933 -6.9865 -9.1068 -3.9096 -0.8703 0.4231
hfenergy: -845.7565582 hartree
pointgroup: C01 [X(C20H16O1)]
dipole: 0.697902 1.5467411 -0.108864 debye
polarizability: 334.4364207|21.154641|306.6150268|-8.2523527|2.0559304|102.8628177 unknown
InChI: InChI=1S/C20H16O/c21-18-11-12-5-1-2-6-13(12)19-16-9-3-7-14(16)15-8-4-10-17(15)20(18)19/h3-4,7-10H,1-2,5-6,11H2
charge 0 multiplicity 1
37 atoms
O  -0.049418 -3.46792 -0.103617
C  1.801906 0.3049 -0.010008
C  2.574535 -0.818964 -0.219112
C  0.318345 0.211122 -0.062238
C  2.482811 1.634962 0.32441
C  4.094853 -0.823356 -0.207247
C  3.951443 1.481044 0.773861
C  4.723026 0.583666 -0.21191
C  -0.329234 -1.060621 -0.081099
C  1.94439 -2.15791 -0.491267
C  -0.541324 1.404735 -0.053024
C  0.459779 -2.300555 -0.187686
C  -1.779417 -1.160214 -0.000578
C  -2.02469 1.2855 0.01481
C  -2.622728 0.051938 0.04732
C  -0.291947 2.783563 -0.152334
C  -2.649674 -2.251064 0.047132
C  -2.611844 2.636014 -0.016253
C  -4.045448 -0.365067 0.110925
C  -1.56329 3.529546 -0.129796
C  -4.049879 -1.744401 0.113357
H  2.456688 2.300393 -0.563834
H  1.911894 2.148395 1.120218
H  4.43509 -1.379337 0.694129
H  4.459384 -1.417963 -1.070218
H  4.419118 2.481054 0.848509
H  3.987791 1.028821 1.785215
H  5.794488 0.52398 0.055508
H  4.663882 1.021053 -1.228486
H  2.061044 -2.396459 -1.573361
H  2.488033 -2.969197 0.030934
H  0.671047 3.276698 -0.259431
H  -2.347441 -3.296959 0.04479
H  -3.677679 2.861017 0.029309
H  -4.902826 0.306623 0.152983
H  -1.635944 4.616999 -0.194819
H  -4.930163 -2.389635 0.158209
