program: Gaussian 09
title: 000154823
version: EM64L-G09RevD.01
frameworkgroup: C1[X(C21H16O4S)]
method: RPBEPBE
basis: SDD
operation: Freq
keyword: #p
keyword: freq=noraman
keyword: PBEPBE/SDD
title: #p freq=noraman PBEPBE/SDD
converged: YES YES NO NO
title: Mulliken charges:
elementType: S O O O O C C C C C C C C C C C C C C C C C C C C C H H H H H H H H H H H H H H H H
charge: 1.165706 -0.441550 -0.548253 -0.483874 -0.462307 -0.274337 0.113126 -0.227681 -0.549207 0.188337 0.357698 0.663529 0.309173 0.314914 -0.741279 -0.488867 0.116851 -0.432568 -0.473118 0.422097 -0.813090 -0.485395 -0.333157 -0.436960 -0.259246 -0.249443 0.287321 0.244373 0.259698 0.238402 0.246169 0.229419 0.267031 0.231477 0.241845 0.231959 0.240661 0.221311 0.245547 0.231091 0.233732 0.398867
chargesum: 0.00000
title: Mulliken charges with hydrogens summed into heavy atoms:
elementType: S O O O O C C C C C C C C C C C C C C C C C C C C C
charge: 1.165706 -0.441550 -0.149385 -0.483874 -0.462307 0.012984 0.113126 -0.227681 -0.045137 0.188337 0.357698 0.663529 0.309173 0.314914 -0.502877 -0.242698 0.116851 -0.203150 -0.206087 0.422097 -0.107809 -0.244734 -0.111847 -0.191413 -0.028154 -0.015711
polarizability: 5.15139704e+02 3.77863957e+00 3.84979952e+02 -9.38382089e+00 1.63180004e+01 1.42316045e+02
1716.lowfreq: -19.0234 -4.5949 -1.7328 0.0011 0.0013 0.0016 6.6160 20.7311 26.5871
frequency: -18.2421 20.6115 26.5133 36.5106 54.2611 62.4193 85.7684 107.7255 111.9279 152.6438 160.5404 173.2568 181.6720 220.1442 238.0561 243.8932 266.7414 278.8648 295.5035 311.5898 322.6398 333.5120 349.5988 368.5813 417.4045 421.9529 448.1860 455.9081 472.1720 485.0696 519.0450 531.4987 535.8819 550.1359 558.9293 569.7629 581.2819 612.9435 620.1274 634.7891 676.8326 710.7398 740.5644 760.7275 770.0670 772.6421 797.5494 803.9108 818.1207 823.9695 855.8475 863.9363 865.7767 889.7313 907.3257 934.9179 948.7957 958.6325 962.0943 971.3823 975.3479 981.3615 987.6492 996.3497 1023.0162 1039.0542 1040.1896 1051.5425 1095.9782 1102.3438 1128.8776 1161.1942 1165.6685 1180.4429 1182.8416 1212.0321 1226.6464 1234.0566 1241.1224 1251.9863 1275.4230 1288.5913 1293.2095 1324.8546 1341.5571 1374.3075 1395.5185 1400.5006 1406.0027 1412.5845 1430.9941 1445.4787 1459.7229 1463.3473 1468.6161 1472.5084 1486.6377 1510.7337 1552.6255 1579.6106 1607.5834 1617.1438 1622.8217 1629.9029 2975.0296 2992.6905 3024.5827 3049.4530 3053.1374 3087.7514 3121.3679 3125.2372 3127.7594 3135.8391 3144.7348 3146.2867 3154.0236 3155.2186 3168.4369 3452.3553
redmass: 1.0255 8.3105 11.8369 6.2027 4.4179 4.4017 7.3146 7.1064 4.3007 3.2379 3.3756 5.0210 3.8605 3.0873 3.6375 3.3630 2.8653 3.9222 5.0040 4.7787 8.2523 7.5869 4.2648 5.7860 3.7607 3.2143 4.9791 6.2649 4.7915 5.7926 5.8889 3.5688 3.8032 5.2761 3.7110 6.1355 3.7309 4.9417 5.2281 6.2560 5.7642 3.1489 5.5146 1.3184 4.9792 3.4907 2.0408 5.9938 1.7114 1.9802 7.4063 3.8750 2.4700 1.7363 4.2438 2.0294 2.8920 1.4080 2.1918 1.5182 7.8939 2.4188 1.3647 1.3883 5.5915 2.1765 1.7483 2.3906 2.1229 1.2044 2.0827 1.3675 1.1609 1.1001 1.6175 1.7749 1.5510 1.8719 1.9681 1.8695 1.9243 1.4920 1.2702 3.1730 4.0202 3.2835 2.2421 1.4693 3.7013 3.1668 1.9344 1.5690 2.6797 1.8571 1.0477 2.4542 2.2486 3.7953 5.7636 8.5427 6.3778 6.6921 7.2190 7.9587 1.0379 1.0635 1.0866 1.0977 1.0991 1.0983 1.0866 1.0869 1.0868 1.0887 1.0931 1.0953 1.0975 1.0925 1.0994 1.0656
irintensity: 0.3272 0.9712 0.3164 0.4936 1.9608 0.6814 7.6865 5.9410 1.0804 10.5486 25.7663 4.0308 2.5782 18.5345 9.9239 1.5625 30.4588 27.9933 7.4802 21.1653 18.5266 28.5639 3.6735 51.0086 0.7681 8.1913 3.2080 15.4809 17.0602 2.0211 0.1078 2.4095 18.3229 78.0740 58.7037 19.4392 39.1508 1.1221 4.4227 6.5797 8.3854 2.9467 0.3764 53.7926 4.5177 25.2282 19.1700 1.2748 5.6792 25.7017 117.8776 11.8830 67.8739 4.1239 3.8247 11.9562 52.8413 4.4930 15.2018 1.0659 60.0318 31.1352 0.5337 0.6298 1.4245 5.6478 4.9512 1.7018 5.0709 147.8804 5.8168 1.0626 1.7646 2.0185 6.5126 5.2298 11.5912 9.8985 11.4123 15.9772 8.8366 5.3664 17.5432 27.1993 8.1792 19.2606 1.1792 10.3239 19.5916 4.6646 13.3370 1.8416 0.0854 6.7119 15.2388 29.6444 8.5058 27.8687 6.1997 22.7468 17.1785 34.3716 0.2969 9.6893 32.3951 11.1556 9.4548 21.3018 0.4650 22.0500 6.4993 1.1170 3.9781 6.0424 18.0523 22.2570 5.8253 32.8757 43.4844 53.6574
temp: 298.150 k
press: 1.00000 atm
elementType: 16 8 8 8 8 6 6 6 6 6 6 6 6 6 6 6 6 6 6 6 6 6 6 6 6 6 1 1 1 1 1 1 1 1 1 1 1 1 1 1 1 1
symmnumber: 1
zpe: 817668.6 jmol-1
zpe.correction: 0.311434 hartree
zpe.thermalcorrener: 0.333379 hartree
zpe.thermalcorrenthalpy: 0.334323 hartree
zpe.thermalcorrgfe: 0.259111 hartree
zpe.sumelectzpe: -1506.839488 hartree
zpe.sumelectthermal: -1506.817542 hartree
zpe.sumelectthermalent: -1506.816598 hartree
zpe.sumelectthermalfe: -1506.891810 hartree
dipole: -5.0070 4.7725 -0.6738
dipole: 6.9499
quadrupole: -156.2848 -150.7330 -163.5998
quadrupole: 23.0592 -8.2334 3.0131
quadrupole: 0.5878 6.1395 -6.7273 23.0592 -8.2334 3.0131
hfenergy: -1507.1509214 hartree
pointgroup: C01 [X(C21H16O4S1)]
dipole: 1.7680299 2.0590819 0.3325215 debye
polarizability: 514.5529108|9.7565467|386.4295236|-7.327072|-9.2277838|141.4532668 unknown
InChI: InChI=1S/C21H16O4S/c1-12-6-7-14-10-18-15-5-3-2-4-13(15)8-9-16(18)21-19(25-26(22,23)24)11-17(12)20(14)21/h2-10,19,22H,11H2,1H3
charge 0 multiplicity 1
42 atoms
S  -3.312949 -3.037041 -0.409209
O  -2.075097 -1.610189 -0.542825
O  -2.573385 -3.842206 -1.877377
O  -3.005002 -3.871663 0.933793
O  -4.827949 -2.651624 -0.771705
C  -1.931815 -0.776983 0.703717
C  -0.656601 -0.010245 0.417752
C  -0.998312 1.337422 0.165879
C  -3.060357 0.307448 0.794416
C  -2.388139 1.598407 0.333879
C  0.689672 -0.440124 0.335862
C  -0.032613 2.325701 -0.196109
C  1.705728 0.554135 -0.017938
C  -2.878833 2.888007 0.106303
C  1.321071 1.895746 -0.281301
C  -0.546408 3.649212 -0.422095
C  3.112327 0.12082 -0.095835
C  -1.916771 3.899833 -0.278133
C  1.075493 -1.810154 0.587757
C  3.443305 -1.257375 0.172078
C  -4.347899 3.234736 0.254815
C  2.396887 -2.199403 0.512486
C  4.180588 1.008333 -0.425387
C  4.801805 -1.690977 0.102282
C  5.510337 0.564479 -0.490031
C  5.828676 -0.79622 -0.224537
H  -1.898043 -1.462991 1.570292
H  -3.427666 0.397879 1.835138
H  -3.92478 0.018171 0.168956
H  2.079158 2.635234 -0.558493
H  0.133739 4.461851 -0.701609
H  -2.292305 4.915015 -0.455989
H  0.296108 -2.536673 0.839304
H  -4.53158 4.306737 0.071919
H  -4.970129 2.65972 -0.457094
H  -4.71909 2.996522 1.269745
H  2.680756 -3.239465 0.711803
H  3.975257 2.062164 -0.635193
H  5.030094 -2.742874 0.310451
H  6.307239 1.270989 -0.746285
H  6.867791 -1.138008 -0.275636
H  -1.702411 -3.363347 -2.018444
