program: Gaussian 09
title: 000154820
version: EM64L-G09RevD.01
frameworkgroup: C1[X(C10H13N3O)]
method: RPBEPBE
basis: SDD
operation: Freq
keyword: #p
keyword: freq=noraman
keyword: PBEPBE/SDD
title: #p freq=noraman PBEPBE/SDD
converged: YES YES NO NO
title: Mulliken charges:
elementType: O N N N C C C C C C C C C C H H H H H H H H H H H H H
charge: -0.441914 -0.061966 -0.022720 -0.063691 -0.111711 -0.592500 -0.415028 -0.382930 0.499693 -0.437382 -0.399614 -0.226439 -0.233915 -0.242106 0.230108 0.213750 0.245514 0.231967 0.261595 0.226440 0.239115 0.238490 0.228952 0.226941 0.225115 0.334416 0.229822
chargesum: 0.00000
title: Mulliken charges with hydrogens summed into heavy atoms:
elementType: O N N N C C C C C C C C C C
charge: -0.107498 -0.061966 -0.022720 -0.063691 0.118397 -0.133236 0.078534 0.082624 0.499693 -0.198892 -0.170662 0.000502 -0.008801 -0.012285
polarizability: 1.96437951e+02 1.69687810e+01 8.48923055e+01 2.88230599e+00 6.79566092e+00 1.14106727e+02
1716.lowfreq: -0.0009 -0.0008 -0.0007 4.0785 9.0790 14.1450 27.0859 33.5503 46.9272
frequency: 26.8278 33.4244 46.8246 64.4566 94.8939 137.6936 152.5410 202.6353 216.1596 258.0084 303.7512 328.8401 344.6431 403.8525 445.1698 483.5953 514.8428 532.9829 571.1014 617.1874 622.4654 705.5662 750.8835 807.6852 819.2341 851.0630 857.1464 885.6405 918.7674 930.9323 968.9754 976.1331 990.0480 994.7769 1015.8270 1027.2039 1069.7588 1087.9110 1106.0190 1132.3981 1172.1034 1186.7452 1197.9973 1215.9950 1231.0486 1262.3228 1286.8150 1305.7806 1327.1280 1339.1064 1349.2576 1356.5396 1374.5693 1382.3070 1440.0544 1455.7076 1469.6746 1473.8401 1484.3542 1592.4706 1614.0205 2043.4358 2959.1744 2975.4703 2985.1934 2993.6887 3033.2222 3055.2208 3084.3632 3108.0739 3117.5668 3131.6834 3143.1738 3162.4035 3563.9886
redmass: 5.1836 6.3120 4.1844 5.3354 5.9604 4.6205 3.2359 4.1595 4.7117 3.5574 1.4080 1.9501 1.9248 2.8172 4.0744 12.8854 3.6483 3.1404 8.5725 5.7058 4.1169 1.8208 1.8904 3.5896 3.3526 1.7880 1.5429 1.8198 1.5324 1.8782 3.6679 1.3969 6.0941 1.3193 2.2028 2.1762 1.6044 1.9413 1.7447 1.1659 1.0538 1.1161 1.2913 2.4849 1.2356 5.6395 1.5031 1.3186 1.2630 1.4100 1.3370 1.3670 1.2963 6.9235 2.1535 1.0776 1.0769 1.1325 2.1945 6.0252 6.1853 13.2351 1.0625 1.0773 1.0634 1.0635 1.1054 1.0984 1.1014 1.0878 1.0868 1.0904 1.0956 1.1014 1.0664
irintensity: 0.2445 0.2078 1.4649 0.8412 1.2996 4.2047 2.1823 5.9004 5.6186 7.3480 79.8614 70.8340 8.1194 0.0067 1.6791 0.8319 5.1668 15.0078 11.9075 0.3422 3.2662 47.8124 47.2067 7.8248 2.2820 2.5628 1.6771 14.2299 8.9499 13.3476 98.1033 1.2826 0.2894 0.2656 3.7307 6.5887 8.4289 1.3142 8.5907 17.1661 0.1736 0.0249 10.2393 0.2094 9.3214 93.1341 5.6424 3.9499 4.0518 28.2967 15.3597 17.9143 7.2613 0.4691 7.4191 33.5553 3.5475 22.6505 15.2561 1.6279 10.9896 447.3563 15.9258 45.8059 30.0843 38.4164 17.2781 15.4513 25.8910 12.4326 7.3349 8.3458 41.2626 24.1449 6.7350
temp: 298.150 k
press: 1.00000 atm
elementType: 8 7 7 7 6 6 6 6 6 6 6 6 6 6 1 1 1 1 1 1 1 1 1 1 1 1 1
symmnumber: 1
zpe: 569257.1 jmol-1
zpe.correction: 0.216819 hartree
zpe.thermalcorrener: 0.230708 hartree
zpe.thermalcorrenthalpy: 0.231652 hartree
zpe.thermalcorrgfe: 0.173896 hartree
zpe.sumelectzpe: -627.224168 hartree
zpe.sumelectthermal: -627.210278 hartree
zpe.sumelectthermalent: -627.209334 hartree
zpe.sumelectthermalfe: -627.267090 hartree
dipole: 3.6352 0.7071 2.2814
dipole: 4.3497
quadrupole: -97.8072 -88.3323 -75.5431
quadrupole: 1.0580 -5.7714 3.6986
quadrupole: -10.5797 -1.1047 11.6844 1.0580 -5.7714 3.6986
hfenergy: -627.4409861 hartree
pointgroup: C01 [X(C10H13N3O1)]
dipole: -1.4016069 0.2466156 0.9503663 debye
polarizability: 196.0824998|11.8502963|86.413939|-13.441732|9.6507024|112.9405447 unknown
InChI: InChI=1S/C10H13N3O/c11-13-12-7-10(8-14)6-9-4-2-1-3-5-9/h1-5,10,14H,6-8H2
charge 0 multiplicity 1
27 atoms
O  1.393418 -2.586826 1.175142
N  2.863309 0.325128 -0.604502
N  4.106022 0.508163 -0.735357
N  5.240853 0.676993 -1.049252
C  0.813599 -0.211186 0.65608
C  -0.005098 0.722283 -0.286341
C  2.279082 0.246666 0.78255
C  0.749781 -1.685777 0.200198
C  -1.50701 0.475634 -0.227299
C  -2.192295 -0.160381 -1.29398
C  -2.257053 0.874694 0.911021
C  -3.584895 -0.397371 -1.225972
C  -3.647897 0.640323 0.984894
C  -4.317852 0.000519 -0.084609
H  0.373386 -0.1433 1.674125
H  0.21182 1.769803 0.003337
H  0.370933 0.598308 -1.31819
H  2.334817 1.243955 1.264776
H  2.839939 -0.488053 1.392841
H  -0.299541 -1.986421 0.013402
H  1.332628 -1.817464 -0.72675
H  -1.631564 -0.466391 -2.185935
H  -1.74923 1.384811 1.740274
H  -4.096048 -0.888154 -2.062003
H  -4.210242 0.961325 1.869276
H  0.803447 -2.67649 1.965519
H  -5.397307 -0.179591 -0.030848
