program: Gaussian 09
title: 000154818
version: EM64L-G09RevD.01
frameworkgroup: C1[X(C10H13N3)]
method: RPBEPBE
basis: SDD
operation: Freq
keyword: #pfreq=noraman
keyword: PBEPBE/SDD
title: #p freq=noraman PBEPBE/SDD
converged: YES YES NO NO
title: Mulliken charges:
elementType: N N N C C C C C C C C C C H H H H H H H H H H H H H
charge: -0.066401 -0.013892 -0.068777 -0.205746 -0.410923 0.503666 -0.723001 -0.408485 -0.451568 -0.400794 -0.219842 -0.242655 -0.245254 0.242793 0.203615 0.220091 0.206139 0.215919 0.231331 0.234180 0.252130 0.241698 0.227140 0.226584 0.223587 0.228464
chargesum: 0.00000
title: Mulliken charges with hydrogens summed into heavy atoms:
elementType: N N N C C C C C C C C C C
charge: -0.066401 -0.013892 -0.068777 0.037047 0.012783 0.503666 -0.069611 0.077825 -0.209870 -0.173655 0.006742 -0.019068 -0.016789
polarizability: 1.41571921e+02 4.59053622e+00 1.39078202e+02 1.70844496e+01 1.01933413e+01 9.52635183e+01
1716.lowfreq: -4.9580 -0.0006 0.0004 0.0005 5.8858 12.5770 23.4270 31.1743 54.6339
frequency: 23.1645 29.6323 54.6097 104.4370 110.9411 190.7922 205.1648 221.3924 237.3685 278.1799 339.2769 403.0658 420.5583 483.4573 489.8388 550.2798 554.1032 582.3151 617.3241 706.4832 723.3651 770.4012 790.7224 842.6383 852.8245 910.4901 919.6876 974.8864 983.9754 989.7041 994.6288 1011.6953 1028.1538 1055.2373 1077.4875 1099.0570 1124.0850 1171.6593 1172.8241 1187.8891 1212.7399 1240.4614 1261.1076 1295.1130 1310.0846 1342.8588 1347.1007 1356.2341 1385.9190 1392.3727 1442.9155 1449.3969 1462.3325 1476.1467 1476.4944 1486.8492 1592.2622 1612.6600 2036.9954 2965.2765 2975.4499 2988.2168 3000.9335 3026.7514 3051.4927 3069.0144 3081.9996 3112.9545 3117.6914 3131.8283 3142.8242 3161.8649
redmass: 7.0259 3.9779 6.8838 4.5461 3.4884 3.8425 3.5861 2.8180 1.1298 2.3778 2.6717 2.8072 3.5870 5.8341 4.3606 2.9393 3.1764 6.3367 6.4097 1.6652 3.2330 1.9787 3.1340 2.0978 1.2515 1.6003 1.4677 1.3962 1.6770 5.0534 1.3181 2.3357 2.0958 1.9991 1.8873 1.9311 2.3700 1.0669 1.1755 1.1103 1.7051 1.5190 8.1145 1.3750 1.3394 1.3239 1.4019 1.5341 3.1334 1.3407 2.0638 1.1006 1.0815 1.0959 1.2671 1.5819 5.9313 6.1380 13.2216 1.0562 1.0358 1.0632 1.0822 1.1045 1.1025 1.0991 1.0997 1.0863 1.0870 1.0908 1.0958 1.1014
irintensity: 0.5307 0.2611 0.6376 3.2287 1.6832 2.8875 1.6823 4.0268 0.2445 0.2559 2.1985 0.0153 1.7913 8.3412 5.1105 12.0840 3.5035 16.1149 0.0631 59.3912 3.3860 30.4971 13.3516 0.3964 0.0357 2.8743 5.1573 0.4497 4.6610 0.3146 0.3805 13.0712 3.9161 6.0462 5.9962 5.9463 9.4747 0.4148 1.5499 0.2706 5.6742 12.9036 68.9401 3.0996 4.3169 36.8324 8.0543 10.3464 3.7552 7.8281 10.9548 7.1108 28.1573 7.4895 7.3601 21.8994 1.3362 6.4465 382.2637 27.3719 32.0916 22.1168 14.6166 31.2491 32.0428 62.8962 32.2350 9.8822 5.4525 10.3999 43.4445 23.0821
temp: 298.150 k
press: 1.00000 atm
elementType: 7 7 7 6 6 6 6 6 6 6 6 6 6 1 1 1 1 1 1 1 1 1 1 1 1 1
symmnumber: 1
zpe: 557998.9 jmol-1
zpe.correction: 0.212531 hartree
zpe.thermalcorrener: 0.225292 hartree
zpe.thermalcorrenthalpy: 0.226236 hartree
zpe.thermalcorrgfe: 0.171317 hartree
zpe.sumelectzpe: -552.094173 hartree
zpe.sumelectthermal: -552.081412 hartree
zpe.sumelectthermalent: -552.080468 hartree
zpe.sumelectthermalfe: -552.135386 hartree
dipole: 1.9781 1.5404 1.5375
dipole: 2.9410
quadrupole: -88.1773 -76.5806 -74.2474
quadrupole: -8.4734 -0.2489 2.5028
quadrupole: -8.5089 3.0879 5.4210 -8.4734 -0.2489 2.5028
hfenergy: -552.3067035 hartree
pointgroup: C01 [X(C10H13N3)]
dipole: -0.6813286 0.4986426 -0.7912014 debye
dipolederiv: -0.8644066 0.4781507 -0.2749896 0.7190041 -0.8219551 0.3925722 -0.088008 0.1413384 -0.1542878 0.8874653 -0.7401288 0.2304516 -1.0059067 0.9476155 -0.3665369 0.1749261 -0.2241316 -0.0181949 -0.561039 0.367869 -0.1404102 0.4974208 -0.5086331 0.1630443 -0.1986781 0.1672259 -0.1673252 0.166033 0.025685 0.0337537 0.012832 0.0372173 0.0229363 0.0751699 0.0512398 0.1165167 0.0730645 0.024918 0.0255661 -0.0042153 0.0201225 -0.0090996 -0.0128049 -0.031506 0.0795416 0.0874362 0.1804664 0.0275811 0.2291452 0.1005697 0.0042962 0.0475753 0.0065952 -0.063617 -0.0497968 -0.0179075 0.0112843 0.0161463 -0.0152863 -0.0082105 0.0299199 -0.0261277 0.0773612 0.5817896 -0.0799782 0.2084876 -0.1766901 0.3288891 -0.1994294 0.2612928 -0.2252597 0.4252038 -0.1088372 -0.0122197 0.096642 -0.0320609 -0.1519095 -0.0365036 0.1205893 -0.0199218 0.0064791 -0.1798202 -0.0286094 0.0287364 -0.0037694 -0.0472283 -0.0872796 0.0017531 -0.1358252 -0.0342611 -0.0746009 0.0356808 0.0376198 0.0602069 0.0316236 -0.1057161 0.0229627 -0.1107255 0.0184933 -0.0247371 0.0544812 0.1158884 0.0386459 -0.0536405 -0.0477852 0.1329013 -0.0262264 0.0499208 -0.0632939 0.1115679 0.0454825 0.1038775 -0.0216157 -0.0022283 0.037503 -0.0042799 -0.1115576 0.0250517 -0.0082139 -0.0507755 0.0103304 0.0293597 0.059633 -0.1003355 0.0383345 -0.0862823 0.0116623 0.0672697 -0.1120121 0.0536454 0.0638842 0.0176454 -0.0597246 0.024365 -0.1019615 -0.0617363 -0.1438388 0.0123181 -0.1177952 -0.0820237 -0.0188392 0.0261883 -0.0473193 0.0799595 0.0370942 0.0497736 -0.0747527 0.0374409 0.0656288 -0.001418 -0.1127903 0.0761462 -0.1050049 -0.0324779 -0.1555516 -0.0415109 -0.1314829 -0.1110977 -0.0440381 -0.0378665 -0.0344796 0.0887302 -0.0480371 0.0551529 0.1197119 0.0298192 0.0819452 0.0176323 0.1339414 -0.028964 -0.0353622 -0.1356102 0.0370084 0.1055747 0.0443056 0.0591003 0.0173775 -0.000606 0.0741547 -0.1314772 0.0111915 -0.0402562 -0.0987815 -0.0975094 -0.0810953 -0.023874 -0.1448469 0.0679762 -0.0150158 0.0432262 -0.020954 -0.1234835 -0.0256446 0.0941055 -0.0045849 -0.1227375 0.0148491 -0.0132385 0.123987 -0.0389972 0.0088079 -0.0339893 -0.0278512 0.1201774 0.0087626 0.116514 0.0220244 0.1096983 -0.0345367 -0.0183825 -0.053733 -0.0219093 0.1208804 -0.0054692 0.1273378 0.0096759 0.0282372 -0.0323029 -0.1259347 -0.0275556 0.0983949 0.0233965 -0.1406077 0.0125425 -0.0395163 0.0184562 -0.1345286 -0.046873 -0.1424681 -0.0142106 -0.0040483 -0.0490105 -0.0038526 0.1031958 unknown
polarizability: 136.3722866|0.4679044|134.564941|22.3496029|-16.8758055|104.9764141 unknown
InChI: InChI=1S/C10H13N3/c1-9(7-8-12-13-11)10-5-3-2-4-6-10/h2-6,9H,7-8H2,1H3
charge 0 multiplicity 1
26 atoms
N  2.578656 0.133425 0.500038
N  3.36315 -0.843877 0.664099
N  4.131547 -1.689257 0.997234
C  -0.057479 1.565649 0.344207
C  1.040225 1.578954 -0.759023
C  -1.073007 0.441065 0.12144
C  -0.742591 2.952581 0.438158
C  1.869168 0.288067 -0.821763
C  -1.184586 -0.625565 1.049448
C  -1.923232 0.431986 -1.016792
C  -2.119846 -1.668636 0.853869
C  -2.858124 -0.607123 -1.217849
C  -2.96106 -1.663244 -0.281722
H  0.457714 1.372074 1.305088
H  0.57141 1.732749 -1.751141
H  1.718696 2.435149 -0.581407
H  -1.241911 3.223325 -0.511142
H  0.000107 3.740046 0.665063
H  -1.508505 2.961426 1.233753
H  2.61214 0.344328 -1.64257
H  1.211624 -0.586238 -0.998799
H  -0.532916 -0.635968 1.931878
H  -1.861802 1.245865 -1.75042
H  -2.190289 -2.482018 1.585159
H  -3.507409 -0.593983 -2.100988
H  -3.687081 -2.46938 -0.435919
