program: Gaussian 09
title: 000154800
version: EM64L-G09RevD.01
frameworkgroup: C1[X(C5HCl4NO2)]
method: RPBEPBE
basis: SDD
operation: Freq
keyword: #p
keyword: freq=noraman
keyword: PBEPBE/SDD
title: #p freq=noraman PBEPBE/SDD
converged: NO NO NO NO
title: Mulliken charges:
elementType: Cl Cl Cl Cl O O N C C C C C H
charge: 0.085216 0.085282 0.124169 0.144099 -0.142850 -0.174257 -0.386693 -0.729415 0.798005 0.295122 0.126706 -0.597614 0.372229
chargesum: 0.00000
title: Mulliken charges with hydrogens summed into heavy atoms:
elementType: Cl Cl Cl Cl O O N C C C C C
charge: 0.085216 0.085282 0.124169 0.144099 -0.142850 -0.174257 -0.014464 -0.729415 0.798005 0.295122 0.126706 -0.597614
polarizability: 1.36093662e+02 4.50847249e+00 1.17858551e+02 -4.89627514e-03 4.56815714e-03 6.83818775e+01
1716.lowfreq: -0.0041 -0.0033 -0.0022 5.0262 9.6765 15.6116 47.0871 66.7027 125.4668
frequency: 46.6512 66.6776 125.4656 127.1795 157.6830 181.7327 195.8901 204.3223 248.7039 295.9434 336.3423 359.3667 369.7988 460.2017 521.1358 606.2176 609.4269 627.7742 702.5650 705.8504 758.7828 793.6166 831.9907 884.6161 968.6283 1127.6745 1157.5490 1250.1709 1332.1118 1606.1884 1669.6137 1702.3454 3545.5420
redmass: 20.6682 28.2524 25.6698 23.5148 10.0554 10.1460 26.0289 25.2045 20.4513 21.1729 21.0699 14.6586 23.8902 13.9273 8.7687 12.1394 8.3179 5.6590 12.9153 1.7253 3.5245 9.5840 8.8431 11.2426 6.0050 8.1135 7.6000 9.7022 1.6624 11.3049 8.6561 12.0977 1.0797
irintensity: 0.2103 0.0033 0.0452 0.0268 8.4846 0.0912 0.0145 0.4868 0.5778 0.6033 2.7019 0.7859 1.0172 39.3759 8.2300 14.9826 22.8725 15.0774 106.3939 121.4041 31.2054 117.0233 65.6783 8.5773 38.1575 148.3042 85.4892 187.7719 17.5962 287.3417 516.1593 183.5700 97.1758
temp: 298.150 k
press: 1.00000 atm
elementType: 17 17 17 17 8 8 7 6 6 6 6 6 1
symmnumber: 1
zpe: 147007.6 jmol-1
zpe.correction: 0.055992 hartree
zpe.thermalcorrener: 0.067717 hartree
zpe.thermalcorrenthalpy: 0.068661 hartree
zpe.thermalcorrgfe: 0.016433 hartree
zpe.sumelectzpe: -2235.683833 hartree
zpe.sumelectthermal: -2235.672108 hartree
zpe.sumelectthermalent: -2235.671164 hartree
zpe.sumelectthermalfe: -2235.723392 hartree
dipole: 1.4830 0.4925 -0.0004
dipole: 1.5627
quadrupole: -104.6339 -93.4083 -93.8231
quadrupole: -8.0209 -0.0038 -0.0004
quadrupole: -7.3455 3.8801 3.4654 -8.0209 -0.0038 -0.0004
hfenergy: -2235.7398249 hartree
pointgroup: C01 [X(C5H1Cl4N1O2)]
dipole: 0.5706831 0.2287105 -0.0001631 debye
dipolederiv: -0.1776887 -0.0412808 0.0597486 -0.1687621 -0.2417705 0.2582405 0.1508454 0.1806719 -0.5291971 -0.1774656 -0.0413474 -0.0595595 -0.1686855 -0.2421344 -0.2585193 -0.1504385 -0.1809127 -0.5286286 -0.1435412 0.094214 0.0000391 0.2262688 -0.7196413 0.000005 0.0001028 -0.0000481 0.061896 -0.6596374 -0.2628776 0.0001521 -0.3432211 -0.1993648 0.0000935 0.0002447 0.0000932 0.0852906 -1.1669865 -0.0143283 -0.00044 -0.0372345 -0.4353533 0.0000371 -0.0002981 0.0000239 -0.2807647 -0.6253598 -0.2996737 -0.0001242 -0.175058 -0.9873094 -0.0001014 -0.0000589 0.0000155 -0.2989327 -1.4720083 -0.1581075 -0.0001966 -0.360171 -0.7286581 -0.0001032 -0.000295 -0.0000682 -0.306834 0.5432502 0.3275191 -0.0004175 0.5848756 0.4001798 0.0004605 -0.000459 0.0005191 1.2920217 -1.0119036 0.2848189 0.0001406 0.4973334 -0.8679652 -0.0000238 -0.0001149 -0.0000682 -0.1228015 1.577704 0.0042177 0.0007137 0.5725003 1.0200964 -0.0000362 0.0006667 -0.0002027 0.0925899 1.6287396 0.2235595 0.000268 -0.4975599 1.4828966 0.000032 0.0002293 0.0000364 0.2522654 1.5164442 -0.0542808 -0.0002612 -0.0720369 1.2731841 -0.0000779 -0.0003319 -0.0000564 -0.0842396 0.1684531 -0.0624331 -0.0000631 -0.0582491 0.2458402 -0.0000068 -0.0000927 -0.0000038 0.3673347 unknown
polarizability: 135.4827504|5.5761238|118.4694628|-0.0051635|0.0042637|68.3818775 unknown
InChI: InChI=1S/C5HCl4NO2/c6-2(7)1-3(11)10-4(12)5(1,8)9/h10H
charge 0 multiplicity 1
13 atoms
Cl -1.026975 -1.735174 1.530283
Cl -1.026557 -1.736869 -1.528731
Cl 2.056032 -2.275296 -0.000053
Cl 3.302383 0.448015 -0.000372
O  -3.101844 0.293711 -0.000931
O  1.043672 2.501623 0.000157
N  -1.15741 1.643312 -0.000136
C  -0.773899 -0.687344 0.000178
C  0.549629 0.048958 0.000095
C  -1.866011 0.433849 -0.000508
C  0.258232 1.528347 0.000169
C  1.795614 -0.502833 0.000048
H  -1.628265 2.552401 -0.000298
