program: Gaussian 09
title: 000154793
version: EM64L-G09RevD.01
frameworkgroup: C1[X(C10H12O2)]
method: RPBEPBE
basis: SDD
operation: Freq
keyword: #pfreq=noraman
keyword: PBEPBE/SDD
title: #p freq=noraman PBEPBE/SDD
converged: YES YES NO NO
title: Mulliken charges:
elementType: O O C C C C C C C C C C H H H H H H H H H H H H
charge: -0.180945 -0.193824 0.337576 0.115071 -0.638999 -0.505754 0.404814 -0.768266 -0.467532 -0.147226 -0.375013 -0.224149 0.259577 0.252414 0.222519 0.226812 0.222482 0.214268 0.227422 0.241116 0.226226 0.151596 0.235006 0.164808
chargesum: 0.00000
title: Mulliken charges with hydrogens summed into heavy atoms:
elementType: O O C C C C C C C C C C
charge: -0.180945 -0.193824 0.337576 0.115071 -0.127008 -0.056424 0.404814 -0.104094 -0.000190 0.004370 -0.140006 -0.059340
polarizability: 1.24018237e+02 8.49311774e+00 1.09750698e+02 -1.43654167e+00 -8.86727029e+00 8.93274688e+01
1716.lowfreq: 0.0002 0.0006 0.0008 3.1978 8.8296 10.1460 84.4400 87.1126 121.5654
frequency: 84.4295 87.0986 121.5622 139.7745 166.7568 178.4553 199.4892 278.9007 312.0556 347.3481 377.3690 385.7265 414.9151 451.1079 509.0248 525.0435 595.9937 625.2653 709.4735 717.0198 805.5037 837.9056 883.5376 897.9938 922.3853 941.2028 965.6973 979.4170 989.1238 1001.9745 1056.3014 1064.2046 1077.1001 1094.7266 1145.6037 1167.7530 1205.4432 1233.6164 1273.8128 1299.3310 1338.8478 1351.0551 1365.9154 1382.8436 1397.0474 1417.7138 1451.1988 1453.3097 1471.7300 1476.2392 1480.4822 1600.6540 1622.1771 1645.1731 2864.2684 2866.3879 2965.9193 2977.0338 2994.8990 3042.3279 3056.2512 3061.4897 3082.7759 3088.1697 3103.3894 3188.8635
redmass: 6.8493 4.1052 3.8090 4.7799 3.8267 1.7025 1.5632 2.1882 2.1023 3.0988 2.2120 3.2147 3.7463 3.0582 3.9150 3.4941 4.2401 4.5178 2.6412 3.1411 3.6515 1.3169 2.0328 2.3228 1.3034 1.5627 2.0557 1.8267 1.7446 1.9822 1.3742 1.8034 2.2742 2.0640 1.3712 3.1365 1.4909 1.8092 2.3039 1.4157 2.3636 1.6082 1.6382 1.2652 1.2473 1.8320 1.1057 1.1569 1.0874 1.0718 1.0825 8.4983 8.6547 7.2876 1.0851 1.0847 1.0660 1.0372 1.0608 1.0933 1.1039 1.0991 1.0586 1.0966 1.0915 1.1150
irintensity: 1.6585 5.5738 0.5610 1.5964 12.2792 7.2070 3.8287 2.2478 3.5712 4.2480 2.9123 2.2150 2.6541 1.0907 2.0180 2.0442 5.0865 6.6377 29.5295 17.6313 28.5901 21.9180 5.8923 20.4012 8.0050 12.8685 16.7143 2.8340 3.7983 2.6535 5.9168 1.3887 0.2729 30.7557 8.5685 13.3972 3.5167 36.1813 14.7965 0.9166 10.2871 7.6372 2.0397 6.9087 15.4038 8.1528 1.7459 24.1116 11.6155 4.0712 7.2610 138.4225 218.3652 65.2560 178.8886 52.0975 15.0369 29.5281 36.2360 36.6376 27.3882 25.0724 10.7967 26.6731 19.1165 7.7863
temp: 298.150 k
press: 1.00000 atm
elementType: 8 8 6 6 6 6 6 6 6 6 6 6 1 1 1 1 1 1 1 1 1 1 1 1
symmnumber: 1
zpe: 507310.0 jmol-1
zpe.correction: 0.193224 hartree
zpe.thermalcorrener: 0.204888 hartree
zpe.thermalcorrenthalpy: 0.205832 hartree
zpe.thermalcorrgfe: 0.156183 hartree
zpe.sumelectzpe: -537.748626 hartree
zpe.sumelectthermal: -537.736963 hartree
zpe.sumelectthermalent: -537.736019 hartree
zpe.sumelectthermalfe: -537.785668 hartree
dipole: 5.7040 2.7931 0.9988
dipole: 6.4293
quadrupole: -79.9962 -63.6259 -75.1393
quadrupole: -6.1773 -0.3976 -4.9975
quadrupole: -7.0757 9.2945 -2.2188 -6.1773 -0.3976 -4.9975
hfenergy: -537.9418507 hartree
pointgroup: C01 [X(C10H12O2)]
dipole: -2.2345709 1.14435 -0.3087779 debye
dipolederiv: -0.579394 0.1552002 -0.3289355 0.0817407 -0.4694772 0.0742516 -0.3933791 0.2735597 -0.7044032 -0.8091177 0.1177614 0.1906984 0.2633216 -0.545957 -0.197226 0.28738 -0.133274 -0.4617951 0.266906 -0.0655163 0.0858734 0.1110865 0.0761214 0.0298194 0.238068 -0.1233373 0.2163543 -0.4879935 0.2447338 -0.3559941 0.2471991 -0.3501907 0.1879101 -0.3289013 0.1198507 -0.1480533 0.104846 -0.0710421 0.136338 -0.0249099 -0.0283385 -0.0130953 -0.0322394 0.0210273 -0.0954975 0.0613419 0.0295704 -0.0233562 -0.0033461 0.0328607 -0.0590679 0.0364739 -0.0090348 0.0815673 -0.6110161 0.2355215 0.2291184 0.3027096 0.1161296 0.0258013 0.2172699 0.0178744 -0.1595802 0.0262841 -0.0358487 0.0326106 0.011053 -0.0359614 0.0221859 -0.0099387 0.0063743 0.0539472 -0.1536867 -0.0364455 0.0249586 -0.1368443 0.1338896 -0.0041149 0.080473 -0.0766263 0.0220747 0.5268587 -0.2040723 0.5053924 -0.3690877 0.9558171 -0.267379 0.5808934 -0.301761 0.7357082 0.345764 -0.0467254 -0.1402828 -0.1352987 0.0208893 0.0905784 -0.2257819 0.1428926 -0.0706255 1.2782635 -0.1642056 -0.3744307 -0.0326273 0.5863553 0.285524 -0.2851226 0.2598538 0.3443929 0.0701546 0.0096428 0.016911 -0.0236254 -0.0007179 0.0967602 0.0022076 0.0673346 -0.0141389 0.1025208 -0.0107912 -0.0074176 -0.0183664 -0.0810506 -0.1043317 -0.0057709 -0.0345561 0.0391335 -0.2039477 0.0121476 0.0191446 -0.0288263 0.0672898 0.001174 0.0342276 -0.0104993 0.071373 0.0783006 -0.0351665 0.0378821 0.0126327 -0.0390965 0.064455 -0.0259042 0.0886074 -0.1025185 -0.1471653 -0.0331346 -0.0786565 0.0055456 0.0875976 0.0261112 -0.0984682 0.0078135 0.0345345 0.0717912 0.1133236 0.0290045 0.0336149 -0.1055865 -0.0112432 0.0230122 -0.0340419 0.0838884 0.0567899 -0.0141924 0.022277 -0.0064136 0.0787206 -0.0508072 0.0779343 -0.0058238 -0.1298567 0.0041429 0.0225308 0.0582292 -0.0213533 0.0829468 0.1016666 0.0170016 0.0538122 -0.0600909 0.0195066 0.0631713 0.0101154 0.0914995 -0.1548008 -0.0520178 -0.0304457 -0.0191942 0.0933105 0.0394417 -0.1048793 -0.0675511 -0.0722871 -0.2014099 -0.0836998 -0.0887345 -0.1387569 -0.0345491 -0.0176039 -0.1049274 -0.0193481 -0.1004117 -0.0355111 -0.0661313 -0.0061468 -0.0386515 0.1590604 -0.0429875 -0.0766559 -0.0025811 -0.1870052 -0.1905197 -0.0971236 -0.0641083 -0.1334433 0.045764 unknown
polarizability: 123.8060098|-8.4743913|108.7993552|-2.0999514|10.1113749|90.4910386 unknown
InChI: InChI=1S/C10H12O2/c1-9-4-2-3-8(5-11)10(9,6-9)7-12/h3,5,7H,2,4,6H2,1H3
charge 0 multiplicity 1
24 atoms
O  1.381399 -1.695392 1.417521
O  2.940431 0.028097 -0.877447
C  -1.457349 -0.350965 -0.452305
C  0.110077 -0.463336 -0.262541
C  -0.562643 -0.650739 -1.647849
C  -2.009689 1.080867 -0.279756
C  0.840385 0.806458 0.060727
C  -2.372531 -1.444111 0.099376
C  -1.29493 1.864391 0.857229
C  0.635642 -1.696362 0.408033
C  0.197985 1.876233 0.622033
C  2.286439 0.901121 -0.247167
H  -0.388464 0.134219 -2.390038
H  -0.560218 -1.668474 -2.05568
H  -3.09357 1.022783 -0.067396
H  -1.892495 1.650885 -1.220086
H  -3.350609 -1.405377 -0.415911
H  -1.962084 -2.458195 -0.044029
H  -2.554606 -1.305387 1.181838
H  -1.511219 1.386177 1.836159
H  -1.68774 2.895588 0.920166
H  0.307134 -2.659895 -0.059932
H  0.772342 2.779031 0.876149
H  2.776515 1.84268 0.112005
