program: Gaussian 09
title: 000154781
version: EM64L-G09RevD.01
frameworkgroup: C1[X(C13H8FN)]
method: RPBEPBE
basis: SDD
operation: Freq
keyword: #p
keyword: freq=noraman
keyword: PBEPBE/SDD
title: #p freq=noraman PBEPBE/SDD
converged: NO NO NO YES
title: Mulliken charges:
elementType: F N C C C C C C C C C C C C C H H H H H H H H
charge: -0.200457 -0.021349 0.275386 -0.187127 0.487737 0.240134 -0.652818 0.171135 -0.386125 -0.427380 -0.293580 -0.237491 -0.238441 -0.172700 -0.371805 0.262067 0.292265 0.245144 0.272808 0.233160 0.230915 0.233670 0.244855
chargesum: 0.00000
title: Mulliken charges with hydrogens summed into heavy atoms:
elementType: F N C C C C C C C C C C C C C
charge: -0.200457 -0.021349 0.275386 -0.187127 0.487737 0.240134 -0.390751 0.171135 -0.093860 -0.182237 -0.020771 -0.004331 -0.007526 0.060970 -0.126950
polarizability: 2.39591543e+02 8.92559685e+00 1.60312991e+02 -4.69908008e-03 -3.18785995e-03 5.50161499e+01
1716.lowfreq: -11.8740 -2.1569 -0.0002 0.0009 0.0010 8.3850 99.2197 108.8743 152.5565
frequency: 99.2150 108.8742 152.5518 223.2558 245.3030 268.8977 310.3923 401.6540 414.3388 419.5953 434.1903 495.1395 520.1955 564.6978 575.1777 609.4387 631.7794 631.9384 701.4732 743.1163 771.3007 797.7908 811.8334 837.9102 865.8147 869.9706 915.0325 945.4237 977.4009 991.5737 996.2168 1006.7743 1009.7341 1030.6237 1053.2035 1094.5908 1142.4919 1170.7497 1179.9075 1216.4483 1254.7049 1280.2027 1304.7050 1344.1498 1380.9080 1393.4061 1414.1972 1434.4241 1448.5685 1492.8104 1504.3128 1557.6181 1587.0768 1620.2188 1635.5423 3125.4044 3127.9090 3139.2679 3155.3330 3157.1473 3161.2320 3172.9190 3176.2304
redmass: 4.6276 5.0500 5.6792 5.1018 4.3989 9.8902 4.8338 6.7363 8.9192 4.2357 3.3792 7.7879 3.0253 3.3678 5.8495 7.7853 4.0282 6.9587 5.9941 2.8823 1.3553 5.9461 1.4123 3.1412 4.9852 1.3744 1.8500 1.4253 1.3831 1.3631 7.2979 1.3413 6.1339 2.1996 2.2729 2.3220 1.3224 1.0936 1.3315 1.5496 2.8240 1.9704 3.8901 3.1500 1.9076 4.2341 3.7121 2.4059 3.7316 4.0921 3.9677 7.1023 6.1413 6.7135 8.2852 1.0864 1.0895 1.0906 1.0901 1.0958 1.0926 1.0978 1.0998
irintensity: 3.7751 0.9024 0.0030 4.2724 2.5486 1.6093 1.2492 1.0975 5.3546 0.0277 4.0474 0.7785 6.8471 0.5462 2.7687 1.5243 1.0093 11.4347 0.1681 39.6624 53.0634 2.9631 31.0240 15.7995 3.4564 29.6014 14.8602 0.0026 5.2001 0.5515 50.1436 0.5761 4.2686 3.2558 17.7260 1.0758 9.1378 3.9421 5.0454 7.9896 27.7690 8.8564 16.0222 0.1980 33.9168 13.4224 34.4278 9.9609 0.0310 22.9740 15.5685 10.9186 25.4052 0.0303 41.5012 1.4896 16.8638 15.9043 10.4202 22.8645 4.0046 18.3388 17.3808
temp: 298.150 k
press: 1.00000 atm
elementType: 9 7 6 6 6 6 6 6 6 6 6 6 6 6 6 1 1 1 1 1 1 1 1
symmnumber: 1
zpe: 449223.5 jmol-1
zpe.correction: 0.171100 hartree
zpe.thermalcorrener: 0.181506 hartree
zpe.thermalcorrenthalpy: 0.182450 hartree
zpe.thermalcorrgfe: 0.135031 hartree
zpe.sumelectzpe: -653.792679 hartree
zpe.sumelectthermal: -653.782273 hartree
zpe.sumelectthermalent: -653.781329 hartree
zpe.sumelectthermalfe: -653.828748 hartree
dipole: 0.1088 -0.0759 0.0000
dipole: 0.1326
quadrupole: -67.3722 -84.1113 -90.3124
quadrupole: 6.0777 -0.0008 -0.0002
quadrupole: 13.2265 -3.5126 -9.7138 6.0777 -0.0008 -0.0002
hfenergy: -653.9637791 hartree
pointgroup: C01 [X(C13H8F1N1)]
dipole: 0.0419707 -0.0310158 -0.000004 debye
dipolederiv: -0.5702459 0.4378072 0.0000041 0.4659306 -0.8579693 0.000002 0.000007 -0.0000021 -0.1410428 -0.4673701 -0.0516266 0.0000094 -0.0818986 -0.2998827 0.000006 0.0000182 0.0000056 -0.2258621 -0.1092105 -0.0804208 0.0000046 -0.0893862 -0.0787443 0.0000039 -0.0000087 0.0000045 0.0017704 0.5813969 0.1596605 -0.0000242 -0.083877 0.0630689 -0.0000034 -0.0000206 -0.00001 0.0325359 0.2269393 -0.1472685 0.0000013 -0.0629781 -0.0144121 0.0000031 -0.000001 0.000003 0.0417574 -0.2722824 -0.0012939 0.0000115 0.4213205 -0.1879118 -0.0000055 0.0000074 0.0000051 0.0649566 -0.2005759 0.1558671 -0.0000017 -0.0984812 -0.0196013 -0.0000031 0.0000146 -0.0000072 -0.1694546 0.5472262 -0.4496915 -0.0000093 -0.4444678 0.9712684 -0.0000023 -0.0000135 0.0000008 0.0521849 -0.0914296 0.0918288 0.0000016 -0.02686 0.039322 0.0000013 0.0000037 0.0000026 -0.1238631 -0.1272078 0.1115024 -0.0000039 0.1808081 0.075228 -0.0000103 -0.0000045 -0.0000057 -0.1817235 0.1930351 0.0227604 -0.0000097 -0.0454941 0.1469687 -0.0000022 -0.0000122 -0.0000033 -0.114277 -0.047488 -0.1369331 -0.000002 -0.0771292 0.0589235 -0.0000002 -0.0000112 0.0000023 -0.1663167 0.1237019 0.0393494 -0.0000009 0.0222036 0.005947 -0.0000042 0.000008 -0.0000055 -0.1456435 0.04594 0.0646398 -0.0000103 -0.1327649 -0.2837744 0.0000067 -0.0000145 0.0000037 -0.1231964 0.1102506 -0.0427452 -0.0000018 0.1419774 0.4024823 -0.000021 -0.0000051 -0.0000137 -0.0617215 0.0678832 -0.0794667 0.0000045 -0.0103181 -0.0186504 0.0000054 0.0000007 0.0000035 0.178342 0.1245945 -0.0623089 -0.0000009 -0.015568 0.0070012 0.0000005 -0.0000014 0. 0.1541135 0.0545141 -0.0282964 0.0000024 -0.0960698 -0.0870182 0.000007 0.0000021 0.000006 0.1587129 0.0555157 0.0420588 0.000002 0.0895979 0.023027 -0.0000004 0.0000029 -0.0000023 0.1534208 -0.0090193 0.0966961 0.0000025 0.1177149 -0.0429216 0.0000003 0.0000079 -0.0000031 0.1594352 -0.1427849 -0.0244542 0.0000044 -0.0273417 0.0914654 0.0000017 -0.0000023 0.0000025 0.1604759 -0.1169824 -0.0439103 0.0000112 -0.0343292 0.092854 0.0000042 0.0000181 0.0000054 0.1640887 0.0235995 -0.0737545 0.000005 -0.112589 -0.0866702 0.0000106 0.0000043 0.0000078 0.1313072 unknown
polarizability: 240.0183046|6.7565608|159.8862296|-0.0047841|-0.0030589|55.0161499 unknown
InChI: InChI=1S/C13H8FN/c14-12-8-9-4-1-2-5-10(9)13-11(12)6-3-7-15-13/h1-8H
charge 0 multiplicity 1
23 atoms
F  -1.653527 2.932868 0.000041
N  -1.110551 -1.927416 0.000156
C  0.869225 -0.492249 0.000039
C  -0.584202 -0.651317 0.000086
C  1.432558 0.835155 -0.000008
C  -1.434896 0.515081 0.000088
C  0.560172 1.989314 -0.00002
C  -0.800911 1.807507 0.00003
C  1.738254 -1.621445 0.000043
C  2.853789 0.986407 -0.000031
C  -2.848983 0.333401 0.000118
C  3.129231 -1.448788 0.000022
C  3.690432 -0.137324 -0.000025
C  -3.364745 -0.968568 0.00017
C  -2.455342 -2.067184 0.000192
H  0.98181 2.99948 -0.000055
H  1.281026 -2.614859 0.000051
H  3.280283 1.996273 -0.000057
H  -3.504884 1.208843 0.000123
H  3.789848 -2.322543 0.000019
H  4.77863 -0.010133 -0.000039
H  -4.443454 -1.151573 0.000219
H  -2.831162 -3.09713 0.000237
