program: Gaussian 09
title: 000154758
version: EM64L-G09RevD.01
frameworkgroup: C1[X(C19H17NO3)]
method: RPBEPBE
basis: SDD
operation: Freq
keyword: #p
keyword: freq=noraman
keyword: PBEPBE/SDD
title: #p freq=noraman PBEPBE/SDD
converged: YES YES NO NO
title: Mulliken charges:
elementType: O O O N C C C C C C C C C C C C C C C C C C C H H H H H H H H H H H H H H H H H
charge: -0.428657 -0.417880 -0.463246 -0.036825 0.445924 -0.337615 0.213736 -0.246626 -0.217949 0.308463 0.234451 -0.437137 0.285437 -0.329611 -0.433080 -0.183408 -0.099733 -0.623074 -0.819287 -0.323929 0.462503 -0.343705 -0.481785 0.203017 0.187487 0.235757 0.282330 0.242255 0.226762 0.219655 0.244151 0.238684 0.242275 0.263487 0.330976 0.264279 0.329794 0.206805 0.207193 0.348129
chargesum: 0.00000
title: Mulliken charges with hydrogens summed into heavy atoms:
elementType: O O O N C C C C C C C C C C C C C C C C C C C
charge: -0.097682 -0.088086 -0.115117 -0.036825 0.445924 -0.134598 0.213736 -0.246626 -0.030463 0.308463 0.234451 -0.201379 0.285437 -0.047281 -0.190825 0.043354 -0.099733 -0.403419 -0.094178 -0.060442 0.462503 -0.079426 -0.067788
polarizability: 4.29470387e+02 -7.49598929e+00 2.38741046e+02 -5.39325683e+00 -7.15721141e+00 1.13651783e+02
1716.lowfreq: -3.9443 -0.0006 -0.0004 0.0002 0.7054 5.9854 28.4391 41.2789 48.2219
frequency: 28.4014 41.1445 48.1680 64.9662 80.4435 110.5331 116.8195 131.7487 157.5913 179.8008 195.2989 213.3940 236.4694 248.5163 262.1751 274.2699 277.1360 297.7109 318.6271 336.6478 358.4504 380.4772 429.2777 431.8588 448.9076 473.1461 497.4665 513.2462 516.0242 534.8006 550.3589 574.6143 599.0773 615.8797 638.1967 659.0061 687.6450 736.1184 749.0335 766.3436 788.0442 789.4086 820.2277 841.8807 850.6552 855.1922 880.9081 886.0606 905.1763 933.5985 944.9788 960.7836 972.1864 977.4449 989.5814 1002.1329 1012.2043 1018.8807 1032.9005 1052.1901 1075.7542 1107.9106 1145.1888 1155.3578 1162.7975 1169.2488 1173.4517 1197.9432 1199.8917 1219.3682 1231.1116 1238.1476 1261.0554 1281.7358 1299.6205 1300.5635 1319.6448 1339.0847 1352.7709 1371.9182 1388.1797 1398.3993 1401.6542 1411.0957 1427.8822 1436.0839 1461.3611 1468.9756 1476.3825 1481.3005 1500.1943 1526.8945 1545.9246 1562.5991 1604.2287 1637.1929 1651.8702 2915.4773 2921.3488 2922.0833 2980.3548 2984.6096 3054.2393 3117.7749 3128.1720 3135.7999 3145.7371 3150.5586 3159.0823 3173.0336 3173.6571 3515.6663 3517.4786 3571.3977
redmass: 6.1272 4.2115 4.7149 4.8415 2.5227 2.7456 1.6060 3.7871 3.9743 4.6762 4.3170 3.0161 1.1593 1.6787 2.6142 4.4110 1.1827 4.2474 3.6791 3.6094 4.0512 4.5152 4.5995 4.3473 4.5918 4.4534 3.8413 5.1098 6.0061 4.2146 4.6105 4.2233 4.3142 5.0738 4.9059 5.7896 4.1070 4.2215 4.5778 2.2775 1.9767 4.7056 1.7930 1.5968 3.7896 4.2129 1.8697 3.3538 4.9949 2.8575 6.2869 1.8515 2.9249 4.8668 1.4048 1.6948 1.5415 2.1293 1.5727 2.4607 1.9298 2.0722 1.3954 1.4553 1.0761 1.0972 1.2481 1.2775 1.2834 1.9650 1.4208 1.6376 2.8616 1.2133 3.1349 1.9931 1.8231 1.9772 2.2888 2.6304 2.2714 1.5138 1.2674 2.2038 4.1725 6.1189 1.6061 1.1188 1.0703 3.5095 1.8275 7.1045 7.0121 6.4368 6.9174 6.6275 7.0910 1.0822 1.0838 1.0593 1.1015 1.0411 1.0970 1.0946 1.0876 1.0888 1.0868 1.0872 1.0954 1.0980 1.0983 1.0661 1.0657 1.0666
irintensity: 0.8841 8.7843 0.2739 0.3316 0.4693 2.4126 2.1559 1.3517 9.8804 8.4483 2.1175 13.4302 105.7829 92.4299 39.5166 22.4518 192.2025 5.9297 18.0931 3.2099 8.2410 2.9123 3.0837 0.5404 0.3929 7.1922 9.8735 4.2542 3.0952 4.0555 2.2873 11.7080 4.9962 4.3350 3.8926 6.8007 23.1953 8.3899 15.0626 29.4476 19.0471 3.4566 57.8544 53.6114 1.4074 7.5252 4.9149 14.1293 1.4126 14.9647 119.9577 24.2404 26.9173 66.2350 3.8662 1.0549 12.2464 13.4291 1.3710 0.1515 8.1288 15.0966 39.0472 48.7021 2.7190 87.2259 20.7351 7.9131 2.6983 10.5554 10.6317 0.2093 3.7317 1.7479 1.6726 2.9461 0.4105 7.4480 9.4205 14.0816 8.9818 33.6139 6.1466 9.7979 14.8806 22.7992 1.9807 13.6839 12.1842 3.7002 37.6713 22.3457 1.2837 8.4299 0.4560 4.0111 0.2880 81.6389 80.0463 62.9796 43.4260 23.8121 13.2760 10.1468 5.7996 34.5532 3.9294 0.1275 22.8601 8.8434 21.2709 4.2914 10.7170 2.8793
temp: 298.150 k
press: 1.00000 atm
elementType: 8 8 8 7 6 6 6 6 6 6 6 6 6 6 6 6 6 6 6 6 6 6 6 1 1 1 1 1 1 1 1 1 1 1 1 1 1 1 1 1
symmnumber: 1
zpe: 818505.8 jmol-1
zpe.correction: 0.311752 hartree
zpe.thermalcorrener: 0.332101 hartree
zpe.thermalcorrenthalpy: 0.333045 hartree
zpe.thermalcorrgfe: 0.262641 hartree
zpe.sumelectzpe: -1012.998646 hartree
zpe.sumelectthermal: -1012.978297 hartree
zpe.sumelectthermalent: -1012.977353 hartree
zpe.sumelectthermalfe: -1013.047757 hartree
dipole: 0.3452 3.4919 -1.6356
dipole: 3.8714
quadrupole: -73.9260 -123.7649 -145.0545
quadrupole: 1.3618 -10.2547 -4.6282
quadrupole: 40.3225 -9.5164 -30.8060 1.3618 -10.2547 -4.6282
hfenergy: -1013.3103982 hartree
pointgroup: C01 [X(C19H17N1O3)]
dipole: -0.1551194 -1.3377678 -0.7114947 debye
polarizability: 429.237994|-10.3492531|237.9537744|4.722797|13.3456943|114.6714479 unknown
InChI: InChI=1S/C19H17NO3/c1-10-12-3-4-14-13(5-7-17(22)19(14)23)18(12)20-16-6-2-11(9-21)8-15(10)16/h2-8,17,19,21-23H,9H2,1H3
charge 0 multiplicity 1
40 atoms
O  4.69528 -0.741192 1.622715
O  5.110078 1.22111 -1.564133
O  -6.659206 1.101501 0.697071
N  -0.328965 1.066057 0.142995
C  2.913062 -0.704309 0.038441
C  4.389132 -0.406233 0.20831
C  1.972277 0.333534 0.125825
C  0.553849 0.026565 0.042326
C  4.79875 1.058565 -0.119857
C  0.122357 -1.354583 -0.141928
C  -1.277696 -1.642788 -0.22829
C  2.482557 -2.054964 -0.1445
C  -2.201511 -0.5566 -0.133474
C  2.416329 1.723214 0.289374
C  1.131251 -2.376582 -0.232997
C  3.729077 2.074742 0.191223
C  -1.665334 0.79146 0.060262
C  -3.63401 -0.701853 -0.212395
C  -1.726969 -3.079672 -0.417261
C  -2.577527 1.899257 0.176979
C  -4.490967 0.391823 -0.116305
C  -3.948926 1.710925 0.090304
C  -5.988028 0.22377 -0.278303
H  4.978222 -1.074082 -0.462432
H  5.712398 1.286257 0.47858
H  3.239391 -2.845978 -0.200495
H  1.634023 2.468348 0.458337
H  0.834567 -3.42028 -0.372108
H  4.044078 3.12039 0.271359
H  -4.068614 -1.697786 -0.350849
H  -1.344824 -3.722314 0.397683
H  -2.820604 -3.186437 -0.433386
H  -1.338707 -3.494375 -1.366832
H  -2.13689 2.888081 0.336431
H  5.670097 -0.62109 1.773709
H  -4.645635 2.547111 0.202928
H  5.940986 0.716593 -1.76984
H  -6.283289 0.511683 -1.312756
H  -6.269724 -0.838734 -0.122845
H  -7.627737 1.137264 0.495337
