program: Gaussian 09
title: 000154755
version: EM64L-G09RevD.01
frameworkgroup: C1[X(C19H17NO2)]
method: RPBEPBE
basis: SDD
operation: Freq
keyword: #p
keyword: freq=noraman
keyword: PBEPBE/SDD
title: #p freq=noraman PBEPBE/SDD
converged: YES YES NO NO
title: Mulliken charges:
elementType: O O N C C C C C C C C C C C C C C C C C C C H H H H H H H H H H H H H H H H H
charge: -0.427271 -0.428495 -0.051121 -0.358446 0.293268 -0.315069 0.238700 -0.049237 0.430126 0.300473 -0.255128 -0.499208 0.251602 -0.836001 -0.421446 0.429267 -0.819039 -0.498860 -0.390461 -0.436107 -0.241440 -0.242509 0.233349 0.227840 0.267251 0.265843 0.233380 0.245033 0.244520 0.233405 0.230075 0.243748 0.235062 0.336368 0.345676 0.287356 0.240659 0.229148 0.227689
chargesum: 0.00000
title: Mulliken charges with hydrogens summed into heavy atoms:
elementType: O O N C C C C C C C C C C C C C C C C C C C
charge: -0.090903 -0.082819 -0.051121 -0.125097 0.293268 -0.087229 0.238700 -0.049237 0.430126 0.300473 -0.255128 -0.231956 0.251602 -0.091744 -0.176926 0.429267 -0.111812 -0.263798 -0.103105 -0.195447 -0.012293 -0.014820
polarizability: 4.00624174e+02 2.01703361e+00 2.38413044e+02 -4.43108682e+00 6.31243184e+00 1.10941751e+02
1716.lowfreq: -0.0004 0.0002 0.0007 6.8996 9.0074 12.9568 43.3486 50.2496 78.8272
frequency: 43.3397 50.2318 78.8237 90.3100 122.9383 129.3817 138.8455 170.4154 179.9177 195.9061 209.0638 235.7311 246.2479 264.4397 289.9462 309.9161 332.0662 335.3369 347.0428 376.5735 393.5095 428.4347 436.5910 466.5486 497.5048 513.2811 542.3672 555.4308 559.8392 580.9114 597.9491 606.0980 620.0096 650.1875 688.5951 719.6729 752.5158 766.0824 776.1818 789.9027 824.9798 844.8817 852.1840 870.5188 899.2015 906.1398 931.1904 932.4935 954.6490 969.2305 984.1757 1005.6613 1006.9595 1023.8328 1029.7585 1038.7968 1043.1170 1052.2732 1085.3539 1109.4249 1151.1024 1161.4363 1163.3760 1174.6490 1191.8664 1219.6206 1229.3609 1236.0868 1261.8195 1276.5974 1298.4308 1315.5998 1334.4462 1352.9075 1368.1696 1381.4538 1386.8490 1395.3798 1400.1168 1408.9300 1414.9605 1430.5782 1445.6492 1459.6810 1465.2605 1470.7623 1480.6261 1495.6425 1505.7268 1552.7394 1578.0700 1608.5636 1627.2224 1664.1501 2965.6704 2969.6150 2986.4042 3019.3414 3040.8319 3059.1669 3089.6175 3121.6855 3124.4883 3126.0496 3135.7671 3142.2079 3155.1457 3157.5563 3172.1811 3521.5684 3537.8465
redmass: 5.2199 4.7068 4.7808 3.1260 1.8524 2.6525 2.2545 2.5094 1.4504 4.7512 3.2848 4.8549 3.1726 3.8729 1.1786 3.2460 1.1358 4.4502 4.9501 3.7268 5.6893 3.5468 3.6508 4.7956 4.5478 6.7400 4.6824 4.6867 4.0004 5.5803 3.9444 4.1622 5.0328 5.7560 4.4674 4.4766 4.7820 1.4451 3.3519 3.7127 1.9133 2.4916 3.3598 4.1410 1.6933 1.6858 3.8523 4.1764 6.3953 1.3466 1.3934 1.8648 1.3420 2.6704 2.0104 1.6047 1.7192 2.2101 2.0686 2.0704 1.3981 1.3688 1.8682 1.2578 1.2862 1.5771 1.7155 1.9327 1.6678 1.9781 1.4398 3.8328 1.5302 1.4955 2.8627 3.8495 3.1976 1.2568 1.3003 2.4010 3.2716 2.7058 4.0421 1.0520 1.1256 1.0974 1.2185 3.6788 3.2221 7.1781 6.4942 6.2786 6.8558 7.0838 1.0384 1.0832 1.0409 1.0856 1.0953 1.0968 1.0987 1.0864 1.0919 1.0901 1.0903 1.0922 1.0962 1.0955 1.0971 1.0658 1.0662
irintensity: 0.0249 0.2385 4.2558 1.3076 1.9888 0.5044 0.5943 0.9425 0.6315 3.9933 1.8787 1.0319 3.0683 1.3001 97.6133 3.1504 112.5915 3.3193 4.4791 4.3677 4.9648 9.1258 5.8289 2.5651 2.7052 0.2882 2.3698 3.3190 1.5949 0.2698 16.4038 7.9809 8.1007 0.0244 5.6518 22.6345 1.3752 40.7682 11.5722 7.4747 27.8366 38.1289 10.9024 7.5807 3.6205 3.6244 68.2633 66.5984 44.4737 1.3372 3.4220 17.7795 0.8351 9.6918 3.9162 3.5940 3.3880 4.2837 4.8321 14.7477 4.6625 27.6043 3.4784 13.3150 55.5290 7.8643 4.3481 6.6289 8.5234 2.4298 2.4823 3.1395 4.1807 51.8360 8.4549 12.5735 4.2501 15.9414 21.6214 0.7145 13.9855 6.0676 9.2018 14.8016 23.2948 18.0235 23.3191 52.9395 8.7700 22.7329 53.6562 3.5565 1.5198 28.2442 37.8942 30.2688 18.9061 52.1480 16.0150 11.7139 18.5379 0.8469 14.3916 5.9894 18.4518 13.6081 32.8348 29.3150 21.0908 5.4440 11.0608
temp: 298.150 k
press: 1.00000 atm
elementType: 8 8 7 6 6 6 6 6 6 6 6 6 6 6 6 6 6 6 6 6 6 6 1 1 1 1 1 1 1 1 1 1 1 1 1 1 1 1 1
symmnumber: 1
zpe: 811581.8 jmol-1
zpe.correction: 0.309115 hartree
zpe.thermalcorrener: 0.327937 hartree
zpe.thermalcorrenthalpy: 0.328881 hartree
zpe.thermalcorrgfe: 0.263107 hartree
zpe.sumelectzpe: -937.892048 hartree
zpe.sumelectthermal: -937.873226 hartree
zpe.sumelectthermalent: -937.872282 hartree
zpe.sumelectthermalfe: -937.938056 hartree
dipole: 0.6792 1.3631 0.3936
dipole: 1.5729
quadrupole: -109.1263 -112.8119 -137.0006
quadrupole: -1.6200 -6.3642 0.9108
quadrupole: 10.5199 6.8344 -17.3543 -1.6200 -6.3642 0.9108
hfenergy: -938.2011628 hartree
pointgroup: C01 [X(C19H17N1O2)]
dipole: -0.2726291 0.534836 -0.1502864 debye
polarizability: 400.5452824|-0.8110904|238.4408645|-6.9477864|-5.8243026|110.992822 unknown
InChI: InChI=1S/C19H17NO2/c1-10-9-15-16(19(22)18(10)21)11(2)13-8-7-12-5-3-4-6-14(12)17(13)20-15/h3-9,18-19,21-22H,1-2H3
charge 0 multiplicity 1
39 atoms
O  -3.415934 1.392455 1.54853
O  -4.274229 -0.147166 -1.767197
N  0.054125 -1.062678 0.123914
C  -3.157423 0.995253 0.140592
C  -1.672543 0.692061 0.061634
C  -4.070896 -0.181812 -0.289032
C  -0.70033 1.705701 -0.017372
C  -1.250137 -0.68265 0.142195
C  -3.585449 -1.558618 0.127253
C  0.689186 1.31629 -0.05976
C  1.017194 -0.085445 0.013702
C  -2.240799 -1.759528 0.272203
C  2.415422 -0.508666 -0.018424
C  -1.065003 3.177891 -0.030184
C  1.760499 2.279597 -0.164429
C  3.45119 0.485453 -0.125634
C  -4.623051 -2.645669 0.260939
C  3.085917 1.880929 -0.197395
C  2.776674 -1.886685 0.052814
C  4.818489 0.068952 -0.158202
C  4.123699 -2.272212 0.01924
C  5.152555 -1.289119 -0.087077
H  -3.421038 1.83047 -0.542176
H  -5.090544 0.009569 0.096087
H  -1.830598 -2.753438 0.481613
H  -2.144834 3.336097 0.095733
H  -0.745375 3.663802 -0.971589
H  -0.563003 3.707351 0.800281
H  1.517087 3.344962 -0.220394
H  -4.16383 -3.638248 0.404887
H  -5.288863 -2.448994 1.125016
H  -5.26866 -2.682572 -0.63744
H  3.885044 2.627486 -0.278791
H  -4.366717 1.669645 1.627648
H  -3.459607 -0.521198 -2.194288
H  1.97067 -2.621125 0.134647
H  5.603741 0.83002 -0.239554
H  4.391412 -3.333122 0.075296
H  6.202857 -1.600241 -0.112583
