program: Gaussian 09
title: 000013849
version: EM64L-G09RevD.01
frameworkgroup: C1[X(C15H30O2)]
method: RPBEPBE
basis: SDD
operation: Freq
keyword: #pfreq=noraman
keyword: PBEPBE/SDD
title: #p freq=noraman PBEPBE/SDD
converged: YES YES NO NO
title: Mulliken charges:
elementType: O O C C C C C C C C C C C C C C C H H H H H H H H H H H H H H H H H H H H H H H H H H H H H H
charge: -0.418249 -0.231127 -0.386099 -0.385985 -0.386202 -0.384850 -0.384117 -0.382008 -0.385218 -0.372933 -0.368865 -0.353322 -0.376418 -0.356829 -0.487909 -0.696652 0.170767 0.193341 0.193498 0.193653 0.193755 0.194456 0.194288 0.192797 0.192850 0.193016 0.193238 0.191933 0.191926 0.196333 0.196361 0.189293 0.189168 0.191582 0.190951 0.187658 0.187580 0.216086 0.219714 0.194712 0.194644 0.252490 0.251708 0.209603 0.209671 0.214827 0.374884
chargesum: 0.00000
title: Mulliken charges with hydrogens summed into heavy atoms:
elementType: O O C C C C C C C C C C C C C C C
charge: -0.043365 -0.231127 0.000741 0.001423 0.002542 0.000797 0.002137 0.001851 0.007476 0.005528 0.013667 0.021916 0.059382 0.032528 0.016289 -0.062552 0.170767
polarizability: 2.32606605e+02 -1.29735087e+00 1.50706974e+02 1.54936026e-01 -1.62795133e-01 1.31220144e+02
1716.lowfreq: -3.7721 -0.0020 0.0002 0.0010 6.2001 13.7136 16.2563 18.6325 35.2438
frequency: 15.7348 18.6225 32.0944 35.3570 51.6038 56.8461 62.6890 79.1587 92.3609 98.2318 107.9110 121.3392 131.7327 135.9906 145.2389 157.1172 157.7932 160.7972 224.2411 226.6711 257.2834 301.9628 358.7669 388.0186 437.1444 465.2052 495.5401 500.0520 509.9356 588.6324 635.5458 721.4899 722.6371 724.1670 728.2721 739.4846 760.1927 790.3981 828.2083 856.4699 870.8903 886.9430 916.0387 960.8845 974.5485 985.2278 998.9151 1002.0400 1022.0619 1028.8461 1034.2063 1047.4869 1064.8959 1068.6666 1079.9172 1081.2645 1082.2809 1083.5001 1099.6858 1117.4133 1124.4803 1180.9313 1196.0888 1198.9180 1216.7781 1221.6851 1238.2024 1238.9391 1254.5448 1259.6535 1274.2936 1276.6370 1278.5083 1284.5092 1287.8722 1293.6793 1294.9604 1295.9627 1300.7311 1301.0798 1315.2233 1332.9225 1346.6198 1352.9456 1354.7191 1356.1936 1358.7529 1372.2754 1388.3459 1437.8987 1460.1620 1460.2411 1462.6196 1462.9300 1464.9990 1465.7696 1469.2384 1473.4957 1476.3403 1477.8858 1482.1293 1485.9508 1488.9106 1490.2835 1669.4712 2949.1495 2949.2302 2950.2562 2950.9569 2951.9741 2952.5007 2954.8347 2958.6482 2962.6846 2966.1841 2968.8679 2971.6787 2982.0436 2984.0648 2986.3202 2986.9818 2990.8663 2995.8724 2996.1860 3002.8520 3011.8153 3020.9474 3028.6980 3032.8043 3038.6413 3044.0216 3062.5639 3068.2836 3070.3024 3512.5047
redmass: 4.6745 4.7789 3.5636 3.9653 4.1368 1.6664 2.9846 1.6180 2.5760 4.2695 1.7270 2.2563 5.2324 1.8670 2.1008 2.0059 3.8622 2.0611 3.7831 1.1340 4.4210 3.6318 3.5277 3.7844 3.1068 3.5501 2.8152 1.8928 2.9947 4.6142 1.3330 1.0585 1.0631 1.0737 1.0980 1.1315 1.1767 1.2237 1.2592 4.8589 1.2722 1.9058 1.2601 1.2236 5.5145 4.6877 4.2001 1.1672 4.0835 2.8912 1.0711 3.3220 2.5985 2.8061 2.0502 2.3955 2.1667 2.2212 2.7714 1.4483 3.1649 1.9271 1.6597 1.2607 1.4800 1.3178 1.3793 1.3676 1.3827 1.2841 1.3623 1.1952 1.0183 1.0476 1.1018 1.1087 1.3166 1.1340 1.1164 1.1059 1.4079 1.4565 1.5173 1.7049 1.6241 1.6545 1.6412 1.8347 1.2171 1.0844 1.0731 1.0728 1.0711 1.0695 1.0605 1.0773 1.0828 1.0841 1.0426 1.0857 1.0901 1.0940 1.0963 1.0983 8.2275 1.0583 1.0584 1.0588 1.0587 1.0593 1.0590 1.0595 1.0594 1.0590 1.0585 1.0585 1.0366 1.0959 1.0965 1.0619 1.0970 1.0990 1.0854 1.0743 1.1025 1.1039 1.1044 1.1026 1.1020 1.1045 1.1045 1.1031 1.1007 1.0993 1.0639
irintensity: 0.0202 0.0573 0.5664 0.0419 0.2310 0.0624 0.0483 0.0847 0.0246 0.5600 0.0338 0.0490 0.1266 0.0165 0.0158 0.0153 0.6256 0.0206 1.0057 0.0072 1.5446 0.2409 1.4816 4.1648 0.3932 15.0731 2.5370 25.3525 16.2426 14.3567 127.0374 16.0153 1.4336 17.7357 0.1328 4.5273 0.2401 3.3346 0.1756 1.3497 2.1067 4.8725 0.0572 1.0771 11.1967 0.5502 61.0888 0.2709 48.6632 64.1009 0.6223 43.3942 60.3380 0.4484 1.2434 0.4879 0.7189 3.6122 9.2255 0.8252 17.7506 0.1057 0.0383 37.8637 0.0775 2.4081 0.1137 0.0858 4.8945 0.0289 7.6020 0.2882 0.0643 0.1501 0.0438 0.0385 8.4463 1.7573 0.0025 0.0090 11.3323 7.8010 8.9552 0.1374 0.7788 1.4954 2.5693 30.5368 11.2594 27.6445 0.0066 0.0421 0.0395 0.1085 0.0216 0.1727 0.8825 0.8542 12.2625 2.3272 0.8456 3.0457 1.1316 50.2236 208.2267 0.0227 0.0972 0.2210 0.3320 1.6664 4.6290 0.1156 3.7078 2.1993 150.6051 237.9285 37.0980 0.0481 0.1819 5.1947 0.4697 0.7991 15.2371 26.5306 0.5322 1.5702 0.2951 9.4047 2.2878 1.3292 322.8673 91.1664 100.7956 55.7673 17.5737
temp: 298.150 k
press: 1.00000 atm
elementType: 8 8 6 6 6 6 6 6 6 6 6 6 6 6 6 6 6 1 1 1 1 1 1 1 1 1 1 1 1 1 1 1 1 1 1 1 1 1 1 1 1 1 1 1 1 1 1
symmnumber: 1
zpe: 1109860.4 jmol-1
zpe.correction: 0.422723 hartree
zpe.thermalcorrener: 0.445206 hartree
zpe.thermalcorrenthalpy: 0.446150 hartree
zpe.thermalcorrgfe: 0.366396 hartree
zpe.sumelectzpe: -738.641668 hartree
zpe.sumelectthermal: -738.619185 hartree
zpe.sumelectthermalent: -738.618241 hartree
zpe.sumelectthermalfe: -738.697995 hartree
dipole: -0.4782 -1.5016 0.0453
dipole: 1.5765
quadrupole: -111.3660 -115.7295 -106.2170
quadrupole: -9.8916 0.3554 0.1935
quadrupole: -0.2618 -4.6254 4.8871 -9.8916 0.3554 0.1935
hfenergy: -739.0643914 hartree
pointgroup: C01 [X(C15H30O2)]
dipole: -0.1901368 0.5850603 -0.0791448 debye
polarizability: 232.5927681|1.6496959|150.4853166|0.4315414|-2.1203348|131.4556383 unknown
InChI: InChI=1S/C15H30O2/c1-2-3-4-5-6-7-8-9-10-11-12-13-14-15(16)17/h16H,2-14H2,1H3
charge 0 multiplicity 1
47 atoms
O  9.014505 0.675674 -0.006939
O  8.020117 -1.398609 0.30217
C  -1.115488 0.501564 -0.030042
C  -2.395176 -0.363946 0.008419
C  0.187353 -0.328226 0.017439
C  -3.698047 0.466053 -0.036124
C  1.466524 0.53803 -0.020599
C  -4.97781 -0.399335 0.003618
C  2.769096 -0.291499 0.034441
C  -6.280934 0.430491 -0.04142
C  4.047193 0.576021 -0.006147
C  -7.560704 -0.434869 0.000571
C  5.344032 -0.259737 0.063998
C  -8.864045 0.395131 -0.049664
C  6.606168 0.621914 0.012933
C  -10.136996 -0.477793 -0.004052
C  7.895341 -0.168063 0.120527
H  -1.128377 1.211724 0.823344
H  -1.12108 1.122707 -0.950356
H  -2.388867 -0.986248 0.927909
H  -2.383499 -1.073104 -0.845755
H  0.200463 -1.038663 -0.835571
H  0.192621 -0.948989 0.937913
H  -3.709378 1.17561 0.817792
H  -3.704905 1.087948 -0.955933
H  1.45029 1.251407 0.830055
H  1.463108 1.155433 -0.943449
H  -4.971196 -1.020905 0.923618
H  -4.966438 -1.109288 -0.849931
H  2.784552 -1.006778 -0.814157
H  2.773054 -0.906526 0.958454
H  -6.291804 1.141626 0.81123
H  -6.288381 1.050752 -0.962382
H  4.045516 1.184407 -0.935083
H  4.024843 1.297017 0.838108
H  -7.556512 -1.052709 0.923151
H  -7.549755 -1.148377 -0.850088
H  5.368639 -0.986032 -0.771156
H  5.354214 -0.862324 0.992275
H  -8.873236 1.109715 0.798756
H  -8.867849 1.009958 -0.973042
H  6.645549 1.212746 -0.923014
H  6.60113 1.367641 0.833021
H  -10.163498 -1.183308 -0.856075
H  -10.173548 -1.075836 0.926242
H  -11.054379 0.138003 -0.046327
H  9.842991 0.129189 0.076221
