program: Gaussian 09
title: 000154751
version: EM64L-G09RevD.01
frameworkgroup: C1[X(C19H17NO2)]
method: RPBEPBE
basis: SDD
operation: Freq
keyword: #p
keyword: freq=noraman
keyword: PBEPBE/SDD
title: #p freq=noraman PBEPBE/SDD
converged: YES YES NO NO
title: Mulliken charges:
elementType: O O N C C C C C C C C C C C C C C C C C C C H H H H H H H H H H H H H H H H H
charge: -0.420331 -0.417061 -0.048878 -0.399421 0.357486 -0.441391 -0.166961 0.460407 0.241253 0.216889 0.286883 -0.099776 -0.420515 -0.385596 -0.840398 -0.590846 -0.335197 -0.247009 -0.239705 0.447265 -0.353849 -0.819956 0.194996 0.205415 0.233764 0.282784 0.245050 0.262112 0.235300 0.246216 0.335263 0.334130 0.262831 0.227005 0.228731 0.234700 0.231649 0.231480 0.225284
chargesum: 0.00000
title: Mulliken charges with hydrogens summed into heavy atoms:
elementType: O O N C C C C C C C C C C C C C C C C C C C
charge: -0.085068 -0.082931 -0.048878 -0.204425 0.357486 -0.235976 -0.166961 0.460407 0.241253 0.216889 0.286883 -0.099776 -0.186751 -0.102812 -0.097937 -0.344630 -0.072367 -0.020004 -0.010974 0.447265 -0.119149 -0.131543
polarizability: 3.81089459e+02 6.99572356e-01 2.30048376e+02 7.15629111e+00 4.27556628e+00 1.12612378e+02
1716.lowfreq: -8.1517 -4.4948 -0.0007 -0.0007 -0.0005 2.4647 42.7104 46.2897 73.3733
frequency: 42.6498 46.2461 73.3697 89.8231 102.5859 116.3125 127.1365 139.7436 163.1945 185.7196 204.1066 221.2862 233.2900 238.9037 263.7304 302.7665 324.9512 345.0914 358.8452 372.5439 373.7051 440.3186 443.9882 477.3385 489.7230 516.0868 524.6335 537.5074 556.0057 583.8492 595.6970 604.5800 640.9435 668.2357 724.7023 738.2586 745.1327 774.4418 780.8998 796.0511 818.4834 841.2647 859.7184 891.0716 892.8879 912.2719 932.5974 953.2710 958.9560 969.4389 982.6649 1000.7637 1002.1139 1021.0099 1036.8196 1039.1023 1048.0364 1057.9708 1079.9864 1105.9204 1144.6167 1151.6858 1160.3936 1171.7085 1203.8535 1210.2303 1215.8618 1249.0744 1257.1693 1284.5704 1294.0413 1299.6406 1308.5799 1347.3253 1373.5404 1385.6831 1392.5544 1397.6200 1397.8510 1407.3836 1423.7162 1441.1368 1457.5749 1463.6260 1467.8121 1476.5291 1485.5034 1492.7665 1502.5020 1550.0044 1583.1853 1593.6802 1618.0491 1631.2234 2909.0817 2922.6008 2974.2914 2982.8922 3051.0032 3056.7963 3084.1829 3117.0321 3121.1896 3123.5003 3134.8675 3135.4439 3155.3356 3162.9754 3170.8733 3515.8290 3517.5040
redmass: 4.6171 4.3727 3.7654 1.1088 3.5955 4.4835 1.1233 3.9614 3.5750 4.1233 4.8343 4.2408 1.2569 2.8769 1.2493 4.0604 4.7138 4.2948 3.4859 4.2842 4.2770 3.5408 4.8842 4.5695 5.1427 4.5680 5.1476 3.6285 4.8286 4.5388 5.3136 3.7107 6.2471 6.1595 4.0777 4.7940 4.7814 1.4656 3.3863 4.7706 3.0915 1.6286 4.3959 1.4788 1.5529 5.0188 2.9445 5.0898 3.4782 1.7678 1.3360 1.4835 1.3524 2.8028 2.1097 1.6525 1.5575 3.6203 1.9297 1.8548 1.3869 1.5305 1.2387 1.0824 1.6588 1.8209 1.7361 1.7796 1.9143 1.3498 1.4429 2.3148 2.6487 1.8155 3.3741 3.9229 2.5190 1.4848 1.6178 1.6335 4.8145 2.6430 2.1881 1.2085 1.0464 1.6664 1.3005 1.9653 2.7633 6.9738 6.3944 7.3969 6.6797 6.3920 1.0826 1.0840 1.0373 1.0411 1.0973 1.0960 1.0987 1.0954 1.0867 1.0890 1.0899 1.0907 1.0958 1.0958 1.0973 1.0659 1.0655
irintensity: 1.2033 0.0238 1.6277 0.0533 0.1376 2.9931 0.6517 0.6509 2.4413 4.3446 0.8619 7.9477 146.3961 9.0587 154.5090 1.2205 2.9135 2.1568 0.6939 0.9391 5.1472 1.9240 3.2526 2.6905 1.3727 9.5185 3.2451 6.7339 9.9179 2.9841 10.8175 10.7640 2.7007 6.9525 3.3786 6.0166 10.5704 78.4020 3.3022 5.9403 20.3612 39.2823 11.7883 4.4398 0.5116 1.7024 8.1906 93.0611 17.0875 4.6525 1.8030 12.0480 3.3851 4.8124 5.4344 3.6202 12.1945 3.4618 7.1950 1.7658 10.6611 55.1993 58.8223 8.1833 23.5998 0.0553 1.1006 5.3890 0.7399 1.4500 5.1359 2.3282 1.1957 21.1569 29.9694 1.0258 3.3512 9.7816 7.8723 22.5535 4.3679 21.7031 11.0562 21.4193 12.0813 3.5530 20.6936 5.5797 24.8494 38.4347 60.8528 1.9578 6.1011 10.0597 70.0955 84.2659 47.1745 21.9845 19.4237 12.6260 17.5747 16.4428 5.4201 16.4125 16.4023 21.7342 30.9488 12.5664 21.9136 6.9059 4.7041
temp: 298.150 k
press: 1.00000 atm
elementType: 8 8 7 6 6 6 6 6 6 6 6 6 6 6 6 6 6 6 6 6 6 6 1 1 1 1 1 1 1 1 1 1 1 1 1 1 1 1 1
symmnumber: 1
zpe: 809541.9 jmol-1
zpe.correction: 0.308338 hartree
zpe.thermalcorrener: 0.327453 hartree
zpe.thermalcorrenthalpy: 0.328398 hartree
zpe.thermalcorrgfe: 0.261600 hartree
zpe.sumelectzpe: -937.894553 hartree
zpe.sumelectthermal: -937.875438 hartree
zpe.sumelectthermalent: -937.874494 hartree
zpe.sumelectthermalfe: -937.941292 hartree
dipole: 0.8163 3.7522 -0.0449
dipole: 3.8402
quadrupole: -101.8534 -107.7668 -138.4405
quadrupole: -5.7623 4.4174 4.0492
quadrupole: 14.1668 8.2534 -22.4202 -5.7623 4.4174 4.0492
hfenergy: -938.2028916 hartree
pointgroup: C01 [X(C19H17N1O2)]
dipole: -0.3330696 -1.473687 -0.0048028 debye
polarizability: 381.0612599|-0.5881679|229.9689873|-7.7200136|-5.188687|112.7199666 unknown
InChI: InChI=1S/C19H17NO2/c1-10-7-8-15-14(9-10)11(2)16-17(20-15)12-5-3-4-6-13(12)18(21)19(16)22/h3-9,18-19,21-22H,1-2H3
charge 0 multiplicity 1
39 atoms
O  1.468392 -2.353313 -1.611772
O  2.440116 -1.651107 1.979597
N  -0.401804 1.342854 0.033186
C  1.268196 -2.076368 -0.169202
C  0.157312 -1.047931 -0.078266
C  2.583919 -1.617013 0.503685
C  0.516711 0.353206 -0.024601
C  2.969947 -0.202899 0.142703
C  1.945476 0.758822 -0.068989
C  -1.196335 -1.419662 -0.102702
C  -2.19416 -0.375976 -0.012549
C  -1.739459 0.994946 0.053677
C  4.326033 0.180889 0.074996
C  2.304814 2.105991 -0.328631
C  -1.64598 -2.861257 -0.252109
C  -3.603664 -0.632461 0.009336
C  -2.706492 2.047823 0.136655
C  4.678912 1.521651 -0.192159
C  3.660097 2.485599 -0.389377
C  -4.542734 0.404053 0.094567
C  -4.069785 1.759649 0.157273
C  -6.034338 0.126228 0.121519
H  0.960057 -3.017323 0.341345
H  3.391942 -2.323588 0.199598
H  5.106099 -0.570185 0.24871
H  1.499913 2.831262 -0.478016
H  -2.370573 -2.952933 -1.081572
H  -0.810529 -3.536876 -0.483542
H  -2.151118 -3.223573 0.663987
H  -3.96254 -1.66657 -0.037118
H  2.282024 -2.912835 -1.722555
H  2.168481 -2.566691 2.254324
H  -2.329855 3.07419 0.184473
H  5.733382 1.814452 -0.242859
H  3.925968 3.528671 -0.593983
H  -4.801445 2.574506 0.22218
H  -6.495565 0.504882 1.053555
H  -6.549939 0.627909 -0.719395
H  -6.249576 -0.953721 0.053031
