program: Gaussian 09
title: 000154749
version: EM64L-G09RevD.01
frameworkgroup: C1[X(C19H15NO2)]
method: RPBEPBE
basis: SDD
operation: Freq
keyword: #p
keyword: freq=noraman
keyword: PBEPBE/SDD
title: #p freq=noraman PBEPBE/SDD
converged: YES YES NO NO
title: Mulliken charges:
elementType: O O N C C C C C C C C C C C C C C C C C C C H H H H H H H H H H H H H H H
charge: -0.442913 -0.441339 -0.040404 0.288296 0.332723 -0.250890 0.251124 0.254885 -0.053637 0.429392 -0.396648 -0.535501 -0.374811 -0.496199 -0.564808 0.394136 -0.387226 -0.375387 -0.435944 -0.241494 -0.450090 -0.241332 0.258122 0.212380 0.210016 0.220545 0.234305 0.271894 0.287101 0.262095 0.241265 0.230213 0.229901 0.204250 0.228660 0.347229 0.340092
chargesum: 0.00000
title: Mulliken charges with hydrogens summed into heavy atoms:
elementType: O O N C C C C C C C C C C C C C C C C C C C
charge: -0.095685 -0.101247 -0.040404 0.288296 0.332723 -0.250890 0.251124 0.254885 -0.053637 0.429392 -0.138526 -0.113105 -0.154266 -0.261894 -0.292914 0.394136 -0.100125 -0.113292 -0.194679 -0.011281 -0.015939 -0.012671
polarizability: 4.16410636e+02 -1.61037025e+01 2.54047820e+02 8.00194888e+00 -2.89049557e+00 9.88967706e+01
1716.lowfreq: -7.9777 -3.2187 -0.0008 -0.0008 -0.0006 4.2226 37.7880 41.4740 54.5583
frequency: 37.7819 41.4561 54.5485 67.4969 73.4159 118.2804 135.4437 167.1314 185.3943 225.7371 248.8443 260.4539 285.4251 312.2541 314.7211 329.7614 352.4678 375.8851 410.5262 424.6722 439.4089 471.4121 508.4040 518.9491 523.2966 547.8028 574.8845 586.9428 597.4393 646.0561 655.2032 671.3571 705.9889 738.9257 761.4467 765.0359 779.2529 798.8511 814.6525 824.1739 848.7910 861.3920 899.3074 901.4347 925.6462 926.8987 948.0840 952.9094 966.9212 968.3851 982.1026 994.1731 1006.8182 1026.6235 1031.2160 1057.4389 1105.5414 1149.7677 1152.2239 1159.8136 1169.8383 1180.9329 1198.0069 1200.2852 1231.4867 1244.2967 1245.3465 1268.2871 1286.5869 1314.3316 1327.8154 1341.4765 1363.6536 1374.2813 1395.4721 1403.2265 1414.3851 1430.4566 1441.7680 1450.6909 1464.7246 1481.9031 1493.1082 1509.9014 1534.0450 1557.5347 1561.9319 1610.0957 1619.0438 1637.1277 2961.8701 2969.4258 3026.4163 3053.3887 3122.4189 3126.4888 3136.2458 3136.8120 3142.9130 3155.8826 3159.5319 3165.3477 3172.0963 3540.0957 3556.1447
redmass: 5.4777 5.1921 4.4862 4.5289 4.5371 4.7597 3.9634 5.1993 4.9513 4.1606 1.1015 3.0633 4.5238 4.9252 5.0918 2.9813 4.5954 1.3721 4.4569 3.0477 3.1897 4.6323 5.2608 3.7580 4.6438 4.3796 3.8503 7.2598 4.4750 6.2836 5.2499 5.8496 3.1510 5.0337 6.2038 1.4195 2.3439 2.9026 2.1700 1.6018 3.6150 4.6517 1.6534 1.6124 4.5665 4.4150 4.6660 2.0567 1.3567 1.4249 1.4058 2.5326 1.3461 2.4196 2.2612 2.7735 2.0802 1.4316 1.1703 1.3513 1.1375 1.5723 1.1671 1.2611 1.8892 1.7831 1.8246 2.2512 1.6815 1.6053 3.2502 2.8977 1.3132 3.0678 3.3041 1.7826 3.1207 2.8575 4.5930 3.4011 1.1193 2.4318 2.5549 1.4494 7.0709 7.0221 7.2375 6.4706 6.5538 6.9065 1.0638 1.0656 1.0969 1.0972 1.0866 1.0881 1.0861 1.0903 1.0919 1.0959 1.0968 1.0953 1.0973 1.0664 1.0663
irintensity: 2.4807 0.7834 0.1120 6.3558 1.0017 0.3255 1.5031 4.1643 1.8929 7.7332 131.2752 11.2779 1.9585 5.1250 4.6387 6.6031 14.8227 151.4212 19.3639 14.0050 2.8733 16.5403 2.6201 3.8948 2.8997 1.4710 10.1951 4.2146 7.4720 2.3412 16.9459 4.9209 14.3900 13.0329 4.3984 21.9817 34.9443 28.1576 29.1992 13.1656 18.2386 4.2401 10.9485 39.0337 10.8177 29.7361 61.7119 55.1172 0.9944 6.1602 4.0984 6.6679 0.7955 17.2754 2.1847 7.3460 9.1585 3.7698 26.5635 15.6053 1.4241 11.0417 17.6492 11.9926 8.2281 1.4604 10.7840 0.2103 8.6644 13.1338 1.7878 13.7513 76.3378 2.2343 20.4361 5.9960 3.6450 2.5938 2.4996 5.5869 8.2825 23.2486 30.5990 8.3904 12.0215 8.1852 2.2591 0.0240 5.3528 6.3019 58.7035 54.6770 36.2953 17.7749 0.8551 7.9828 4.5427 17.4245 6.7230 34.8234 20.5360 20.3090 22.0606 3.8298 11.2409
temp: 298.150 k
press: 1.00000 atm
elementType: 8 8 7 6 6 6 6 6 6 6 6 6 6 6 6 6 6 6 6 6 6 6 1 1 1 1 1 1 1 1 1 1 1 1 1 1 1
symmnumber: 1
zpe: 756002.7 jmol-1
zpe.correction: 0.287946 hartree
zpe.thermalcorrener: 0.305865 hartree
zpe.thermalcorrenthalpy: 0.306809 hartree
zpe.thermalcorrgfe: 0.241440 hartree
zpe.sumelectzpe: -936.714947 hartree
zpe.sumelectthermal: -936.697028 hartree
zpe.sumelectthermalent: -936.696084 hartree
zpe.sumelectthermalfe: -936.761453 hartree
dipole: 1.3375 2.6819 -1.0348
dipole: 3.1706
quadrupole: -127.0075 -102.0526 -131.9305
quadrupole: -4.4668 0.2620 -5.7483
quadrupole: -6.6773 18.2776 -11.6003 -4.4668 0.2620 -5.7483
hfenergy: -937.0028934 hartree
pointgroup: C01 [X(C19H15N1O2)]
dipole: -0.4837348 1.0889105 0.3691364 debye
polarizability: 417.4701687|10.1373536|253.033585|6.2057407|-3.2101178|98.851473 unknown
InChI: InChI=1S/C19H15NO2/c21-10-12-5-7-15-17(11-22)16-8-6-13-3-1-2-4-14(13)19(16)20-18(15)9-12/h1-9,21-22H,10-11H2
charge 0 multiplicity 1
37 atoms
O  0.570428 3.84893 -1.06643
O  5.913259 -1.896338 -0.71831
N  0.035934 -1.069705 0.133353
C  -0.777152 1.263189 0.091373
C  0.554506 1.760482 0.170809
C  -0.989714 -0.177783 0.087465
C  1.641649 0.829172 0.180714
C  -2.357155 -0.709814 0.039874
C  1.322959 -0.593278 0.168651
C  -3.467003 0.200505 -0.016721
C  -1.932187 2.13671 0.010169
C  0.79064 3.253124 0.27288
C  3.033815 1.200449 0.190711
C  -3.21374 1.627751 -0.03801
C  2.385107 -1.559308 0.192382
C  3.72209 -1.166897 0.220649
C  -2.605186 -2.111606 0.048621
C  4.038271 0.238587 0.206297
C  -4.794994 -0.319808 -0.061859
C  -3.918992 -2.604223 0.00483
C  4.847868 -2.185631 0.261595
C  -5.021426 -1.704232 -0.050592
H  -1.772555 3.21629 -0.056471
H  0.082962 3.691455 1.007511
H  1.815604 3.465283 0.628575
H  3.315489 2.257669 0.162638
H  -4.072797 2.305945 -0.108018
H  2.094337 -2.615545 0.18533
H  -1.742607 -2.78254 0.090669
H  5.092748 0.535458 0.196911
H  -5.638855 0.378932 -0.107072
H  -4.09902 -3.684793 0.013077
H  5.378795 -2.152461 1.229438
H  4.444106 -3.210011 0.123906
H  -6.044434 -2.094889 -0.085537
H  0.746405 4.824179 -1.014024
H  5.508043 -1.848149 -1.621585
