program: Gaussian 09
title: 000154743
version: EM64L-G09RevD.01
frameworkgroup: C1[X(C16H16ClN5O4)]
method: RPBEPBE
basis: SDD
operation: Freq
keyword: #p
keyword: freq=noraman
keyword: PBEPBE/SDD
title: #p freq=noraman PBEPBE/SDD
converged: YES YES NO NO
title: Mulliken charges:
elementType: Cl O O O O N N N N N C C C C C C C C C C C C C C C C H H H H H H H H H H H H H H H H
charge: 0.004075 -0.207804 -0.186072 -0.204363 -0.211539 -0.143072 -0.041901 -0.088854 0.014278 0.012439 -0.401530 -0.401407 0.463362 -0.322906 -0.338708 -0.653628 -0.653556 -0.291904 -0.359479 0.145874 0.285580 0.303201 0.468998 -0.544531 -0.196239 -0.415805 0.234366 0.231153 0.232769 0.231020 0.237061 0.238687 0.220773 0.240568 0.226094 0.221563 0.241350 0.225209 0.274226 0.258489 0.337451 0.314711
chargesum: 0.00000
title: Mulliken charges with hydrogens summed into heavy atoms:
elementType: Cl O O O O N N N N N C C C C C C C C C C C C C C C C
charge: 0.004075 -0.207804 -0.186072 -0.204363 -0.211539 -0.143072 -0.041901 -0.088854 0.014278 0.012439 0.063989 0.062382 0.463362 -0.085845 -0.100020 0.033807 0.034567 -0.017678 -0.100990 0.145874 0.285580 0.303201 0.468998 -0.207080 -0.196239 -0.101094
polarizability: 7.23711275e+02 1.15990331e+01 2.35104919e+02 8.95240446e+00 7.36900733e+00 1.49513020e+02
1716.lowfreq: -2.1388 0.0003 0.0007 0.0011 1.7102 6.3948 18.6473 22.2461 26.8519
frequency: 18.5500 21.9535 26.7274 49.2608 52.4896 60.6001 65.1797 76.1881 94.4772 104.1495 120.9104 124.7401 141.2463 157.5233 181.4367 193.5464 204.5047 213.2227 220.1298 239.4500 295.9135 303.7910 318.7914 327.2971 345.2083 357.7499 370.0228 396.4543 402.2875 421.2901 444.1684 465.7257 485.5441 509.7789 521.7254 537.6999 546.1328 558.4957 623.7201 636.1901 658.4496 666.8602 684.5666 698.5583 704.2180 739.5030 745.8719 779.4869 787.1120 788.9258 802.0498 820.1145 827.3209 833.6376 891.2489 893.0396 926.6093 926.9207 960.4289 968.9149 979.6870 985.7380 1014.3050 1053.4805 1073.9157 1075.7761 1094.9914 1122.0784 1127.7003 1143.3277 1164.4696 1165.0356 1185.4160 1195.0339 1201.7853 1215.7379 1269.1840 1285.3933 1290.6397 1311.4819 1336.8141 1339.7555 1347.2028 1349.4174 1368.5153 1373.1671 1389.8207 1392.8410 1399.9983 1407.2980 1435.3565 1453.6699 1466.7940 1469.1911 1470.8224 1480.0796 1482.4995 1497.4959 1506.7611 1523.4333 1543.1362 1552.5380 1589.6414 1629.1761 2988.8511 2989.3102 3004.2783 3009.1379 3053.2033 3058.0259 3086.7627 3087.3280 3095.5613 3097.9704 3153.5879 3153.8685 3174.3719 3178.7858 3186.9745 3193.9467
redmass: 6.7040 6.4286 6.1013 5.9054 9.5842 15.0437 3.3743 5.6938 3.6902 3.6063 7.5993 3.8649 8.8824 10.7040 7.0546 1.8664 2.4528 1.3751 3.6840 2.1993 5.3737 3.2459 5.1759 16.9586 8.7957 8.1853 5.8658 4.7819 6.3907 3.7472 3.9726 4.5715 3.7215 2.8694 6.6349 4.2009 4.2564 3.0433 7.0439 5.4155 9.9605 9.5062 5.7780 7.0375 8.0318 4.6127 6.1151 5.7503 1.2085 1.2777 1.3111 8.0363 4.7517 1.8287 2.6105 6.7801 2.0900 1.4438 1.4292 1.3440 1.3559 2.7599 2.9433 2.0615 2.2482 1.8291 1.7111 3.1957 1.5476 3.1953 1.8805 1.8646 4.7804 2.2612 1.7214 6.3217 1.3317 1.2086 3.2114 1.3916 5.1393 1.2640 1.4760 5.2641 10.5193 3.8111 1.2129 1.2488 3.0360 2.6961 7.8253 7.8904 1.1098 1.0747 2.0252 1.2711 1.0517 1.1400 1.4657 2.0442 5.4861 10.0324 8.1391 6.5197 1.0357 1.0357 1.0606 1.0611 1.1026 1.1023 1.0999 1.0998 1.1015 1.1011 1.0883 1.0875 1.0952 1.0962 1.0927 1.0924
irintensity: 0.5840 0.0486 0.1562 0.2186 0.5779 0.1132 0.0447 0.7345 0.4496 1.0417 4.5021 3.4175 11.1050 2.0266 0.3927 2.9238 0.9762 0.0467 0.6498 5.8128 0.5168 2.0712 1.3188 1.3088 9.9936 0.6998 4.6917 33.1314 21.1278 6.1433 15.4476 6.9436 4.9466 18.0622 16.9994 9.6521 39.1237 14.6463 3.5894 1.3642 2.3548 24.0958 46.9576 53.9366 87.3904 5.6545 23.1738 104.7754 0.4194 14.6833 19.7874 34.0538 171.5054 75.6229 7.1276 37.6345 5.5874 19.8561 23.2434 1.2372 0.3043 0.2297 54.5036 133.7486 12.3074 88.5716 19.6986 113.7941 25.4356 565.9339 1.7954 16.3816 741.7070 35.7720 18.3654 729.5978 97.2571 4.2260 55.1975 3.5058 164.3960 9.7356 242.8621 24.4290 129.4105 6.6444 2.0245 31.6867 39.6500 412.6661 313.9445 580.8745 4.9942 21.8214 2.0724 2.2320 0.4772 31.6451 45.5700 41.6040 208.3141 14.8769 266.0176 449.3668 28.5621 32.7625 42.9913 76.2137 3.5509 4.1995 35.5696 45.5564 24.4353 70.1564 3.6463 2.0926 14.4768 24.7834 11.3890 27.1405
temp: 298.150 k
press: 1.00000 atm
elementType: 17 8 8 8 8 7 7 7 7 7 6 6 6 6 6 6 6 6 6 6 6 6 6 6 6 6 1 1 1 1 1 1 1 1 1 1 1 1 1 1 1 1
symmnumber: 1
zpe: 805150.6 jmol-1
zpe.correction: 0.306666 hartree
zpe.thermalcorrener: 0.331533 hartree
zpe.thermalcorrenthalpy: 0.332477 hartree
zpe.thermalcorrgfe: 0.248917 hartree
zpe.sumelectzpe: -1651.909399 hartree
zpe.sumelectthermal: -1651.884532 hartree
zpe.sumelectthermalent: -1651.883588 hartree
zpe.sumelectthermalfe: -1651.967148 hartree
dipole: -15.3509 -2.5347 1.1090
dipole: 15.5983
quadrupole: -145.6356 -172.7056 -152.4145
quadrupole: -3.8191 -6.6356 7.9490
quadrupole: 11.2829 -15.7870 4.5041 -3.8191 -6.6356 7.9490
hfenergy: -1652.2160649 hartree
pointgroup: C01 [X(C16H16Cl1N5O4)]
dipole: 6.0279487 -0.7350584 -0.8855536 debye
polarizability: 722.5629713|-28.0699502|215.9044254|5.1988096|36.9428064|169.8618181 unknown
InChI: InChI=1S/C16H16ClN5O4/c1-3-20(4-2)12-7-5-11(6-8-12)18-19-16-14(17)9-13(21(23)24)10-15(16)22(25)26/h5-10H,3-4H2,1-2H3
charge 0 multiplicity 1
42 atoms
Cl -1.759624 -2.238201 -1.689876
O  -3.202194 2.759539 2.142703
O  -1.245226 1.58173 2.203951
O  -7.107542 0.809924 0.049899
O  -6.865869 -0.931274 -1.413779
N  5.648427 -0.074112 -0.159496
N  0.086461 -0.912715 0.45367
N  -0.749303 0.054562 0.2064
N  -2.45121 1.771958 1.771238
N  -6.390522 -0.06313 -0.57877
C  6.237069 1.241606 -0.507232
C  6.607511 -1.188767 0.027269
C  4.280793 -0.254683 -0.015282
C  3.353381 0.817331 -0.290856
C  3.732608 -1.513163 0.419682
C  6.303181 1.499147 -2.029569
C  7.045221 -1.379212 1.497502
C  1.979554 0.640089 -0.147687
C  2.354227 -1.681548 0.562277
C  1.449497 -0.617973 0.277634
C  -2.12035 -0.11166 0.127787
C  -2.999962 0.816676 0.792785
C  -4.937905 -0.071048 -0.334507
C  -4.384659 0.854768 0.564462
C  -2.759902 -1.030445 -0.777686
C  -4.134407 -1.022896 -1.0109
H  5.672436 2.044525 -0.00104
H  7.25731 1.269124 -0.082497
H  6.16863 -2.121103 -0.370686
H  7.492714 -0.972297 -0.598539
H  3.723027 1.790119 -0.624788
H  4.391364 -2.350118 0.662288
H  6.906724 0.724327 -2.53554
H  5.296568 1.493412 -2.482159
H  6.768478 2.481166 -2.231095
H  7.533761 -0.467664 1.885864
H  6.181541 -1.603032 2.146976
H  7.765479 -2.213698 1.577058
H  1.285305 1.461977 -0.349662
H  1.937066 -2.635887 0.899691
H  -5.011442 1.581839 1.085949
H  -4.604916 -1.733393 -1.695038
