program: Gaussian 09
title: 000154736
version: EM64L-G09RevD.01
frameworkgroup: C1[X(C14H7N3O6)]
method: RPBEPBE
basis: SDD
operation: Freq
keyword: #p
keyword: freq=noraman
keyword: PBEPBE/SDD
title: #p freq=noraman PBEPBE/SDD
converged: NO NO NO NO
title: Mulliken charges:
elementType: O O O O O O N N N C C C C C C C C C C C C C C H H H H H H H
charge: -0.159053 -0.159043 -0.148816 -0.148796 -0.194974 -0.185808 -0.034114 -0.065423 0.023877 0.338628 0.081093 0.270751 0.477031 0.248238 -0.660073 0.299410 -0.497676 -0.371773 -0.453445 0.377253 -0.417768 -0.319419 -0.235693 0.269622 0.309277 0.272957 0.262888 0.299926 0.266370 0.254553
chargesum: 0.00000
title: Mulliken charges with hydrogens summed into heavy atoms:
elementType: O O O O O O N N N C C C C C C C C C C C C C C
charge: -0.159053 -0.159043 -0.148816 -0.148796 -0.194974 -0.185808 -0.034114 -0.065423 0.023877 0.338628 0.081093 0.270751 0.477031 0.248238 -0.390451 0.299410 -0.188399 -0.098816 -0.190557 0.377253 -0.117842 -0.053048 0.018860
polarizability: 2.61295171e+02 -2.72266869e+01 2.84493985e+02 -1.82883477e-02 5.01996982e-03 1.03796996e+02
1716.lowfreq: -66.3345 -33.9835 -0.0006 -0.0001 0.0007 2.7961 6.2230 8.3825 35.5184
frequency: -66.3304 -33.9442 35.4785 50.3486 66.4279 92.6076 106.7051 124.6918 127.1423 162.3845 175.4692 230.2675 256.6370 264.7606 300.0855 316.6290 338.0174 360.4173 396.4533 425.4534 456.5516 461.4621 490.4631 537.1114 555.1604 566.6870 607.0335 626.4688 637.1345 637.4607 681.1766 682.1246 691.4696 713.0119 727.1784 729.3215 746.7181 774.0835 785.4557 812.6566 837.4888 846.6789 895.6263 906.3104 930.1878 934.1644 980.4696 987.5412 988.6531 1016.9482 1093.9403 1105.3123 1135.8751 1165.5129 1193.3019 1207.5008 1208.0904 1231.1880 1252.4746 1262.2796 1278.7760 1305.3884 1361.8354 1376.7930 1378.8686 1382.3639 1387.7485 1400.5590 1421.0575 1429.5510 1445.8731 1496.5466 1535.3487 1577.5026 1606.8904 1620.1578 1628.0478 3145.8140 3158.5569 3162.3546 3163.2882 3181.3052 3195.2713 3241.1765
redmass: 13.4553 11.6608 11.5787 11.5563 9.4159 5.5518 14.1447 5.5893 12.9511 11.3875 6.7939 5.9797 10.9744 4.9236 9.1127 8.0189 5.2069 10.5744 3.7093 6.9234 4.6448 7.7155 3.8276 6.6617 7.8593 4.2036 8.3980 3.9239 8.5499 5.8847 9.6183 8.7339 5.1751 10.9453 3.4383 8.7702 9.2947 2.2373 7.8759 2.0237 1.5860 7.8121 1.4052 1.7849 1.4921 8.3497 6.1596 1.3741 1.3399 6.1515 2.0806 2.4070 2.3342 1.4205 1.4539 3.1462 2.9479 4.0676 4.4572 4.0600 2.8528 1.6407 4.4736 8.3151 14.3423 14.5248 4.5115 3.7949 2.7303 4.0473 2.6277 3.6137 4.9005 8.5345 6.2809 6.5102 8.2978 1.0890 1.0932 1.0917 1.0904 1.1001 1.0962 1.0893
irintensity: 0.0326 0.6543 0.1327 1.0632 2.6079 0.8832 0.7537 0.0474 4.7879 2.5247 0.1619 0.1529 3.6729 4.5182 0.2199 3.7805 0.1491 6.9559 5.9429 0.4136 0.2730 2.0445 1.2113 3.4396 4.1511 0.2150 3.3108 0.1567 11.3899 0.6771 4.6769 13.0107 29.6859 16.1437 3.1331 32.9799 22.2680 19.1430 4.7461 23.0081 23.7531 13.8826 20.6804 8.2988 12.5012 0.0868 3.9988 1.9153 3.0290 0.4726 15.5000 2.1468 11.2051 10.2333 77.8465 183.7718 117.6750 81.1973 10.6901 58.1922 2.2396 2.8099 2.0708 72.7735 112.9595 212.7793 0.9655 30.0023 22.8982 5.6420 17.8807 6.1350 0.7605 0.1797 0.6513 20.6151 3.2620 2.1082 1.1757 4.1457 1.8360 6.3221 4.4999 7.6783
temp: 298.150 k
press: 1.00000 atm
elementType: 8 8 8 8 8 8 7 7 7 6 6 6 6 6 6 6 6 6 6 6 6 6 6 1 1 1 1 1 1 1
symmnumber: 1
zpe: 507272.4 jmol-1
zpe.correction: 0.193210 hartree
zpe.thermalcorrener: 0.209890 hartree
zpe.thermalcorrenthalpy: 0.210834 hartree
zpe.thermalcorrgfe: 0.147876 hartree
zpe.sumelectzpe: -1151.453319 hartree
zpe.sumelectthermal: -1151.436638 hartree
zpe.sumelectthermalent: -1151.435694 hartree
zpe.sumelectthermalfe: -1151.498652 hartree
dipole: -6.1233 4.1741 0.0022
dipole: 7.4106
quadrupole: -155.2560 -119.7428 -138.6926
quadrupole: -16.4894 0.0124 -0.0069
quadrupole: -17.3589 18.1543 -0.7955 -16.4894 0.0124 -0.0069
hfenergy: -1151.6465287 hartree
pointgroup: C01 [X(C14H7N3O6)]
dipole: -2.6622262 -1.1887155 -0.0008493 debye
polarizability: 271.5338358|29.5632728|274.2553197|0.0188889|0.0016954|103.7969962 unknown
InChI: InChI=1S/C14H7N3O6/c18-15(19)9-4-5-10-11(7-9)14-8(6-13(10)17(22)23)2-1-3-12(14)16(20)21/h1-7H
charge 0 multiplicity 1
30 atoms
O  -2.915829 3.255905 1.145038
O  -2.91677 3.25546 -1.144996
O  1.835797 -2.984839 -1.14534
O  1.835991 -2.985159 1.144678
O  4.374123 2.407131 0.000874
O  4.32632 0.123078 0.001195
N  -2.656276 2.727284 0.000015
N  1.268839 -2.823832 -0.000259
N  3.751518 1.276559 -0.00032
C  0.138073 0.087548 -0.00006
C  -0.673461 -1.144204 -0.000046
C  -0.527877 1.37621 -0.000038
C  -2.119282 -1.029235 0.000012
C  -1.970276 1.404044 -0.000012
C  -2.743486 0.270157 0.000012
C  -0.185163 -2.490802 -0.000084
C  1.566706 0.102169 -0.000069
C  0.224193 2.591892 -0.000056
C  -2.962496 -2.181993 0.000046
C  2.262197 1.315657 -0.000113
C  1.617224 2.576923 -0.000093
C  -1.01281 -3.622435 -0.000035
C  -2.421549 -3.469606 0.000041
H  -3.835987 0.334835 0.000024
H  2.181896 -0.794987 -0.000111
H  -0.298853 3.552273 -0.000031
H  -4.047981 -2.038858 0.000095
H  2.214416 3.491208 -0.000165
H  -0.561539 -4.619035 -0.000064
H  -3.06706 -4.352146 0.000066
