program: Gaussian 09
title: 000154732
version: EM64L-G09RevD.01
frameworkgroup: C1[X(C14H7N3O6)]
method: RPBEPBE
basis: SDD
operation: Freq
keyword: #p
keyword: freq=noraman
keyword: PBEPBE/SDD
title: #p freq=noraman PBEPBE/SDD
converged: YES YES YES YES
title: Mulliken charges:
elementType: O O O O O O N N N C C C C C C C C C C C C C C H H H H H H H
charge: -0.171240 -0.192371 -0.186753 -0.185270 -0.197288 -0.181995 0.017880 0.020282 0.021621 0.275030 0.252284 0.364624 0.311956 0.256526 -0.752033 0.217935 -0.345057 -0.555563 -0.377900 0.435476 -0.437372 -0.412209 -0.229762 0.362817 0.234315 0.361917 0.242217 0.296453 0.301318 0.252164
chargesum: 0.00000
title: Mulliken charges with hydrogens summed into heavy atoms:
elementType: O O O O O O N N N C C C C C C C C C C C C C C
charge: -0.171240 -0.192371 -0.186753 -0.185270 -0.197288 -0.181995 0.017880 0.020282 0.021621 0.275030 0.252284 0.364624 0.311956 0.256526 -0.389216 0.217935 -0.110742 -0.193647 -0.135683 0.435476 -0.140918 -0.110891 0.022402
polarizability: 3.71789089e+02 1.24483235e+01 2.47574262e+02 -5.10403700e-03 -1.65950591e-02 7.02154646e+01
1716.lowfreq: -45.4794 -35.4085 -8.6982 -0.0014 -0.0007 0.0002 3.0220 7.2234 25.2298
frequency: -45.4761 -35.4051 25.2163 44.0614 62.7889 116.3192 121.6513 147.8449 155.9192 166.4390 228.3290 264.9651 273.0793 311.6701 313.3301 328.5798 367.1679 389.0256 409.7978 457.9067 461.4236 466.3990 519.4233 529.1262 549.5971 555.7039 580.1598 612.5140 616.5650 658.5309 678.7397 693.7225 714.5718 720.9066 729.3758 746.2174 752.6496 781.4870 806.1367 833.5916 853.1550 876.4110 887.1305 956.3334 966.1072 983.0845 996.1938 1000.0799 1009.6834 1019.3680 1087.7094 1098.9322 1128.7115 1167.4735 1174.3384 1181.8373 1192.6525 1205.5972 1216.2472 1251.8043 1265.2940 1305.7168 1337.4751 1359.8687 1377.8087 1386.3726 1392.6858 1403.5433 1414.2722 1446.2003 1450.3381 1489.0462 1535.0526 1575.6094 1600.5962 1613.1176 1620.8559 3159.6148 3173.2245 3185.3977 3193.1728 3196.7746 3205.7382 3214.3656
redmass: 15.8926 15.8459 11.1220 10.7855 6.6170 6.2766 12.2501 4.9398 14.3807 4.8590 12.3039 10.8748 4.6100 12.0374 6.6833 8.3885 11.1235 9.9573 3.4749 8.5209 4.9772 8.0417 3.4213 6.3850 4.3569 7.3429 4.7405 8.0553 6.7929 8.9946 7.3552 7.2303 5.4645 10.2883 7.3431 3.1385 10.9152 2.0376 10.0815 1.4900 5.6494 8.1887 2.8162 1.4788 4.7940 1.4776 1.3770 1.4711 1.3723 7.3196 1.8876 2.0330 2.6216 1.5311 2.3517 6.4671 4.4138 2.4770 4.4651 1.7760 1.7551 2.3976 3.9076 5.2400 8.6973 5.8352 6.2971 4.9364 4.8557 3.0203 2.8841 4.5427 4.4283 7.5661 7.3508 7.4738 7.3471 1.0884 1.0900 1.0916 1.0962 1.0954 1.0904 1.0915
irintensity: 0.0003 0.0384 2.0251 0.1555 0.6136 0.8395 2.2548 0.2326 0.1717 3.4417 0.1676 2.6367 4.4233 1.4905 0.5076 1.2431 2.4845 1.8646 1.1006 4.2761 4.8587 0.0641 6.3922 1.3433 0.4082 4.2068 0.1290 1.1714 13.8875 0.7002 0.3429 16.6465 15.3803 46.4496 10.2643 13.3611 40.7235 6.9615 4.6445 71.3881 10.9337 13.3662 0.5347 0.9230 35.6673 19.8916 8.5127 17.5868 7.1513 11.5506 37.8892 28.9317 24.4471 4.5549 104.3119 280.7090 396.3182 107.0325 116.9621 52.2898 1.8522 4.7155 8.3696 53.8696 91.3728 26.9771 57.3074 8.0425 81.1356 1.8750 0.4201 45.6653 13.5971 4.7175 0.1703 11.0563 10.9816 4.4974 1.9858 6.4289 7.2918 6.8195 51.5678 34.6192
temp: 298.150 k
press: 1.00000 atm
elementType: 8 8 8 8 8 8 7 7 7 6 6 6 6 6 6 6 6 6 6 6 6 6 6 1 1 1 1 1 1 1
symmnumber: 1
zpe: 510482.0 jmol-1
zpe.correction: 0.194432 hartree
zpe.thermalcorrener: 0.210579 hartree
zpe.thermalcorrenthalpy: 0.211523 hartree
zpe.thermalcorrgfe: 0.149555 hartree
zpe.sumelectzpe: -1151.467420 hartree
zpe.sumelectthermal: -1151.451273 hartree
zpe.sumelectthermalent: -1151.450329 hartree
zpe.sumelectthermalfe: -1151.512297 hartree
dipole: -2.9904 -8.7684 -0.0003
dipole: 9.2643
quadrupole: -175.5507 -130.7679 -128.7108
quadrupole: 10.2665 0.0011 -0.0008
quadrupole: -30.5409 14.2419 16.2990 10.2665 0.0011 -0.0008
hfenergy: -1151.6618519 hartree
pointgroup: C01 [X(C14H7N3O6)]
dipole: -1.2718332 -3.4157789 -0.0001125 debye
polarizability: 372.3842278|8.9822896|246.9791232|-0.0055627|-0.016447|70.2154646 unknown
InChI: InChI=1S/C14H7N3O6/c18-15(19)8-4-5-10-9-2-1-3-13(16(20)21)12(9)7-14(17(22)23)11(10)6-8/h1-7H
charge 0 multiplicity 1
30 atoms
O  -0.438888 3.726462 0.000185
O  1.752513 3.155788 -0.001245
O  -5.538077 0.277444 0.000117
O  -3.960345 1.903498 -0.000089
O  5.534717 -1.500095 0.000448
O  5.242787 0.762717 0.000151
N  0.5001 2.845178 -0.000563
N  -4.305677 0.660664 -0.000246
N  4.792541 -0.443092 0.000065
C  0.518836 -1.042326 -0.000022
C  -0.931318 -1.269224 -0.000009
C  1.064538 0.301467 -0.000205
C  -1.833834 -0.13681 -0.000133
C  0.101502 1.391995 -0.000332
C  -1.267076 1.185492 -0.000282
C  -3.252319 -0.408615 -0.000111
C  1.430531 -2.145292 0.000158
C  2.48408 0.47522 -0.000167
C  -1.475603 -2.589673 0.000138
C  3.315833 -0.645031 0.00003
C  2.812958 -1.968873 0.000185
C  -3.753398 -1.717832 0.000049
C  -2.856625 -2.811276 0.000169
H  -1.925733 2.053062 -0.000372
H  1.051713 -3.16868 0.000299
H  2.920392 1.473006 -0.000326
H  -0.81578 -3.459234 0.00023
H  3.507448 -2.812092 0.000323
H  -4.835282 -1.867623 0.000063
H  -3.249336 -3.832223 0.000289
