program: Gaussian 09
title: 000154716
version: EM64L-G09RevD.01
frameworkgroup: C1[X(C13H17N3O2S)]
method: RPBEPBE
basis: SDD
operation: Freq
keyword: #p
keyword: freq=noraman
keyword: PBEPBE/SDD
title: #p freq=noraman PBEPBE/SDD
converged: YES YES NO NO
title: Mulliken charges:
elementType: S O O N N N C C C C C C C C C C C C C H H H H H H H H H H H H H H H H H
charge: 0.967422 -0.551474 -0.511251 -0.504812 -0.090336 -0.087822 -0.390996 -0.308491 -0.172778 0.071989 0.445096 -0.254594 -0.397517 -0.227978 -0.611879 -0.616129 -0.304297 -0.168413 -0.348129 0.223376 0.270012 0.211148 0.202606 0.338912 0.299354 0.244007 0.246566 0.220981 0.192077 0.223639 0.231516 0.193166 0.219506 0.253175 0.239725 0.252619
chargesum: 0.00000
title: Mulliken charges with hydrogens summed into heavy atoms:
elementType: S O O N N N C C C C C C C C C C C C C
charge: 0.967422 -0.551474 -0.511251 -0.165900 -0.090336 -0.087822 0.102392 0.105263 -0.172778 0.071989 0.445096 0.044760 -0.153510 0.018589 0.024818 0.028059 -0.051121 0.071313 -0.095509
polarizability: 2.30425774e+02 1.23456115e+01 2.10581266e+02 -2.31710251e+01 2.59316744e+01 1.59523637e+02
1716.lowfreq: -6.2239 -3.6776 -0.0013 -0.0012 -0.0007 4.2302 13.3619 21.5883 29.1942
frequency: 12.4419 21.2271 29.0678 60.3873 86.9412 91.6743 118.9233 141.5719 162.9344 180.3284 187.9815 208.0518 218.5854 220.8180 228.3520 247.6401 264.6959 336.8357 349.3057 364.1620 402.8745 418.6225 427.7524 449.6221 462.9503 468.0232 519.3946 523.5652 540.1683 556.8397 631.3027 636.7214 770.7922 775.7116 782.4793 801.4667 802.6112 810.6901 817.3663 847.7559 872.2225 932.8455 934.4179 950.1316 953.5648 989.0120 999.2054 1021.4453 1029.6730 1035.6977 1037.7898 1057.8209 1061.9847 1078.8832 1092.3981 1125.1274 1139.1686 1158.6962 1186.9828 1195.6618 1222.7998 1242.1277 1244.1396 1266.2452 1294.1697 1316.6997 1344.6689 1365.4122 1370.4154 1392.3827 1395.4279 1422.2477 1431.5527 1441.2831 1443.8023 1460.6468 1465.1570 1474.9359 1476.0762 1482.5708 1487.2637 1489.8872 1547.4196 1588.0859 1621.7285 2855.0932 2865.4328 2891.9384 2961.1778 3017.5118 3021.8812 3031.1615 3055.8316 3076.2301 3088.2158 3133.7607 3136.4334 3141.2827 3148.3828 3169.1400 3176.2396 3286.3749
redmass: 4.6469 2.7389 4.8514 4.7279 2.2077 5.6958 3.9513 4.7996 3.2359 4.3804 4.9178 2.8649 1.4765 4.0346 2.7576 1.6109 5.3398 2.8014 3.9059 3.9718 3.9184 4.5930 5.3283 3.3942 4.1664 3.1492 6.0777 6.1595 6.5395 4.3910 7.0622 3.4218 1.5062 1.3071 6.2366 2.7085 2.1507 3.3219 4.4138 2.0498 1.9164 5.5661 1.3862 13.0261 1.4463 1.3682 1.3926 2.5657 2.7871 2.1386 2.2004 2.0896 2.6046 1.6181 1.3407 1.7905 1.4926 1.2456 1.6658 1.5567 1.9747 1.7468 1.6168 2.5435 1.1353 1.3232 5.0881 2.0632 1.3261 1.3687 1.6227 1.1400 3.4482 2.4612 1.1531 1.0595 1.0709 1.0637 1.0586 1.0702 1.0619 3.7977 7.2729 5.6371 7.3101 1.0565 1.0577 1.0679 1.0623 1.0731 1.0893 1.0744 1.0992 1.1009 1.1001 1.0885 1.0884 1.0925 1.0913 1.0986 1.0990 1.0765
irintensity: 1.6915 1.4346 0.5012 2.8889 2.1194 0.3328 1.2806 2.1842 6.2239 5.8638 0.6884 1.9951 0.9801 1.8493 1.1423 4.3607 5.2671 4.4387 17.6479 12.2420 8.8181 8.6429 26.5865 16.4353 97.7769 2.2439 5.0759 16.0881 29.9542 22.0231 3.7965 1.1487 22.0462 10.1810 10.2091 34.7285 55.6105 12.9412 6.1169 82.3196 101.4507 6.4110 0.3575 68.4593 1.0178 0.0910 2.1031 6.4842 1.4728 7.0274 51.4299 5.3154 40.7497 9.6791 7.6702 3.9927 7.5828 2.7677 56.2442 1.0031 15.7152 1.2496 27.5088 6.3374 5.5296 11.3019 14.8110 12.5704 18.4536 3.9157 5.0996 3.0919 0.5704 4.9536 3.0561 3.7534 13.4132 13.2431 18.8722 11.4713 14.5841 36.7340 4.4568 4.7582 6.6289 73.2868 164.7053 107.9274 43.4878 42.2407 26.0944 36.6299 17.9664 35.7239 45.9576 3.2738 5.3363 12.7656 4.5351 20.0013 21.3019 84.1835
temp: 298.150 k
press: 1.00000 atm
elementType: 16 8 8 7 7 7 6 6 6 6 6 6 6 6 6 6 6 6 6 1 1 1 1 1 1 1 1 1 1 1 1 1 1 1 1 1
symmnumber: 1
zpe: 742729.0 jmol-1
zpe.correction: 0.282891 hartree
zpe.thermalcorrener: 0.302267 hartree
zpe.thermalcorrenthalpy: 0.303211 hartree
zpe.thermalcorrgfe: 0.232660 hartree
zpe.sumelectzpe: -1216.725562 hartree
zpe.sumelectthermal: -1216.706186 hartree
zpe.sumelectthermalent: -1216.705242 hartree
zpe.sumelectthermalfe: -1216.775793 hartree
dipole: 3.6689 5.7602 -4.8233
dipole: 8.3609
quadrupole: -92.6153 -118.4904 -129.5598
quadrupole: 3.7196 -9.4726 14.1532
quadrupole: 20.9399 -4.9352 -16.0046 3.7196 -9.4726 14.1532
hfenergy: -1217.0084529 hartree
pointgroup: C01 [X(C13H17N3O2S1)]
dipole: -1.509313 -2.0875899 -2.0455818 debye
polarizability: 229.8153603|11.3122716|210.5759066|25.1270833|-25.408696|160.1394104 unknown
InChI: InChI=1S/C13H17N3O2S/c1-16(2)10-9-15-19(17,18)12-7-3-5-11-6-4-8-14-13(11)12/h3-8,15H,9-10H2,1-2H3
charge 0 multiplicity 1
36 atoms
S  0.281713 1.592835 1.052811
O  1.123061 2.794079 0.338315
O  -0.358116 1.791155 2.52471
N  1.377055 0.118674 1.110632
N  4.516616 -1.041424 -0.632934
N  -1.378292 -1.029152 0.807301
C  2.317571 -0.009708 -0.025552
C  3.573765 -0.765446 0.473545
C  -1.145896 1.197375 -0.163971
C  -1.833012 -0.050248 -0.068015
C  -2.983085 -0.246483 -0.929237
C  -1.50784 2.192021 -1.062979
C  -3.362538 0.7881 -1.844751
C  -2.633152 1.976268 -1.921148
C  5.469525 -2.121254 -0.302773
C  5.208027 0.168207 -1.126664
C  -3.686445 -1.48958 -0.812279
C  -3.242095 -2.450664 0.096966
C  -2.073749 -2.18007 0.878874
H  1.89008 -0.551271 -0.89501
H  2.58874 1.011268 -0.349835
H  4.031635 -0.174771 1.304153
H  3.258873 -1.736434 0.900897
H  0.710455 -0.669641 1.250753
H  -0.926885 3.119928 -1.103501
H  -4.234744 0.630721 -2.490089
H  -2.922382 2.75854 -2.629854
H  6.089465 -2.351311 -1.188142
H  6.159107 -1.864653 0.541206
H  4.916916 -3.036997 -0.026411
H  4.477747 0.918059 -1.474875
H  5.853155 0.650911 -0.349276
H  5.848027 -0.10018 -1.986042
H  -4.5656 -1.671609 -1.4409
H  -3.758909 -3.407328 0.214324
H  -1.693692 -2.932717 1.578656
