program: Gaussian 09
title: 000154714
version: EM64L-G09RevD.01
frameworkgroup: C1[X(C15H10Cl2N2O2S)]
method: RPBEPBE
basis: SDD
operation: Freq
keyword: #p
keyword: freq=noraman
keyword: PBEPBE/SDD
title: #p freq=noraman PBEPBE/SDD
converged: YES YES NO NO
title: Mulliken charges:
elementType: Cl Cl S O O N N C C C C C C C C C C C C C C C H H H H H H H H H H
charge: -0.058993 -0.045202 0.942718 -0.495684 -0.524171 -0.557773 -0.100798 -0.179386 0.089290 0.448975 -0.248620 0.442347 -0.391951 -0.227114 -0.301287 -0.311825 -0.383695 -0.164704 -0.347803 -0.025555 -0.051210 -0.253276 0.337019 0.301113 0.247355 0.250878 0.256129 0.308600 0.260920 0.243318 0.256322 0.284066
chargesum: 0.00000
title: Mulliken charges with hydrogens summed into heavy atoms:
elementType: Cl Cl S O O N N C C C C C C C C C C C C C C C
charge: -0.058993 -0.045202 0.942718 -0.495684 -0.524171 -0.220754 -0.100798 -0.179386 0.089290 0.448975 0.052493 0.442347 -0.144595 0.023764 -0.045158 -0.003226 -0.122776 0.078613 -0.091481 -0.025555 -0.051210 0.030790
polarizability: 2.73475410e+02 -2.48697557e+01 2.50411647e+02 1.20584036e+01 -1.67306181e+01 1.91548671e+02
1716.lowfreq: -8.3188 -2.0513 -0.0022 -0.0018 -0.0005 4.9406 13.7303 18.1513 33.6911
frequency: 13.5714 17.6635 33.6890 74.6761 81.7629 106.4935 131.5221 158.3256 162.1215 181.3837 182.0659 197.3571 207.9741 218.0921 224.9722 254.0154 273.6968 338.2489 370.0143 382.3073 405.5817 417.7272 425.7300 439.8196 467.7631 496.1097 511.3556 520.0448 536.1650 540.6113 553.0742 588.7108 629.7849 633.4301 668.3691 752.2233 775.3426 783.0652 799.8626 804.4287 815.3660 847.7485 848.4681 857.0151 869.9809 891.7957 923.0803 930.8613 936.6239 955.6026 965.2614 976.6523 990.8061 1001.0130 1031.2760 1059.7563 1092.9870 1100.9303 1125.2576 1160.1612 1195.6392 1223.1029 1237.7137 1243.0451 1252.3549 1313.6523 1344.9249 1365.7764 1388.3655 1394.3135 1425.3935 1432.7745 1440.4476 1443.2019 1489.8087 1545.7171 1554.9905 1586.8946 1588.1670 1621.8457 3136.3117 3139.1297 3143.6155 3151.5637 3164.3985 3172.2273 3178.4334 3190.5768 3197.5800 3265.0851
redmass: 10.0014 10.4834 6.2173 11.8687 7.9499 7.8727 7.9015 6.8994 16.5247 4.6342 7.6831 7.2801 5.3870 7.7856 9.6267 5.4735 5.8371 8.2577 12.8079 8.4732 9.1767 4.8014 6.2574 6.5870 3.1775 3.9985 5.1878 7.2512 7.3471 5.0536 4.9902 5.8363 5.1591 4.1534 2.2691 9.6271 1.3205 5.9171 2.1312 6.3379 6.5371 1.8429 1.5414 1.4967 1.6166 2.4677 2.7353 5.3004 1.3674 1.4450 8.3200 5.7895 1.3693 1.3939 2.7321 2.0721 1.4704 1.8270 1.8444 1.2548 1.5247 1.9362 3.0490 1.7638 1.2945 1.6451 4.8731 2.1214 4.3669 2.0902 3.0383 3.3974 2.4610 2.2088 3.8235 7.2250 6.3829 5.8860 6.7641 7.3430 1.0891 1.0887 1.0927 1.0914 1.0926 1.0985 1.0990 1.0937 1.0939 1.0762
irintensity: 1.3883 1.3181 0.0842 0.9266 2.4653 2.4884 1.0339 1.8754 0.4650 6.9011 0.0499 2.5620 6.4884 1.4297 3.9425 4.2382 9.6754 19.1191 12.0233 13.4022 6.7639 13.4696 35.3237 40.7175 3.7765 51.2712 0.4537 4.7981 10.0602 1.3021 17.6097 10.6062 3.0252 1.2845 16.9731 80.5468 8.0926 7.5240 57.3285 11.1591 25.8818 62.4049 39.3772 19.3473 72.0653 156.2145 63.9394 9.2400 0.1771 1.4644 62.7090 2.9322 0.1203 1.8255 2.0810 5.5434 3.9499 17.9921 2.6081 2.8184 1.9830 14.1736 1.5321 3.9837 5.2650 30.8006 17.0807 12.4113 11.5100 4.1164 67.0846 0.0702 3.6420 65.4921 38.8877 3.7008 103.8434 48.9874 95.5784 4.6454 2.9211 5.1252 10.2187 5.1097 0.7540 15.7906 17.8617 3.0875 4.3580 89.4379
temp: 298.150 k
press: 1.00000 atm
elementType: 17 17 16 8 8 7 7 6 6 6 6 6 6 6 6 6 6 6 6 6 6 6 1 1 1 1 1 1 1 1 1 1
symmnumber: 1
zpe: 565635.4 jmol-1
zpe.correction: 0.215439 hartree
zpe.thermalcorrener: 0.235175 hartree
zpe.thermalcorrenthalpy: 0.236120 hartree
zpe.thermalcorrgfe: 0.164603 hartree
zpe.sumelectzpe: -2154.019146 hartree
zpe.sumelectthermal: -2153.999409 hartree
zpe.sumelectthermalent: -2153.998465 hartree
zpe.sumelectthermalfe: -2154.069982 hartree
dipole: -6.1703 6.0923 3.7614
dipole: 9.4518
quadrupole: -134.0271 -159.6542 -143.0408
quadrupole: -14.6598 -10.8695 -12.6890
quadrupole: 11.5470 -14.0802 2.5332 -14.6598 -10.8695 -12.6890
hfenergy: -2154.2345847 hartree
pointgroup: C01 [X(C15H10Cl2N2O2S1)]
dipole: -2.5042218 2.4462688 1.2541585 debye
polarizability: 280.3030204|-21.8090923|237.6110398|9.58276|-23.3966106|197.5216686 unknown
InChI: InChI=1S/C15H10Cl2N2O2S/c16-11-7-12(17)9-13(8-11)19-22(20,21)14-5-1-3-10-4-2-6-18-15(10)14/h1-9,19H
charge 0 multiplicity 1
32 atoms
Cl 2.612351 3.827085 -0.907584
Cl 5.533685 -0.704283 0.421436
S  -0.121319 -2.201445 -0.355507
O  -1.11666 -3.122655 -1.231005
O  1.03147 -2.868186 0.576333
N  0.72318 -1.014356 -1.62002
N  -1.999602 0.14469 -1.118886
C  -1.139813 -1.081558 0.809553
C  -2.007182 -0.096929 0.248846
C  -2.857186 0.635145 1.167242
C  -1.041627 -1.325526 2.172825
C  1.765836 -0.192433 -1.126545
C  -2.767771 0.37191 2.572768
C  -1.869327 -0.575421 3.067762
C  -3.75302 1.601135 0.603346
C  2.959353 -0.792132 -0.630515
C  1.649749 1.227901 -1.187152
C  -3.766532 1.806178 -0.777195
C  -2.860667 1.063097 -1.599165
C  2.746435 2.011103 -0.793974
C  4.003665 0.047543 -0.216383
C  3.939998 1.455984 -0.293314
H  -0.112808 -0.499903 -1.975419
H  -0.339255 -2.081175 2.540916
H  -3.414169 0.931514 3.258766
H  -1.798794 -0.762676 4.143525
H  -4.416754 2.170073 1.26404
H  3.047255 -1.879527 -0.587515
H  0.729232 1.695592 -1.549486
H  -4.441487 2.531517 -1.239819
H  -2.835889 1.230174 -2.681716
H  4.777654 2.084064 0.01674
