program: Gaussian 09
title: 000154710
version: EM64L-G09RevD.01
frameworkgroup: C1[X(C15H11N3O4S)]
method: RPBEPBE
basis: SDD
operation: Freq
keyword: #p
keyword: freq=noraman
keyword: PBEPBE/SDD
title: #p freq=noraman PBEPBE/SDD
converged: YES YES NO NO
title: Mulliken charges:
elementType: S O O O O N N N C C C C C C C C C C C C C C C H H H H H H H H H H H
charge: 0.938631 -0.494427 -0.528894 -0.205342 -0.214022 -0.559782 -0.112096 0.017859 -0.180107 0.097525 0.448182 -0.249170 0.434091 -0.390906 -0.227258 -0.299184 -0.518716 -0.313596 0.413644 -0.161702 -0.340604 -0.176469 -0.380991 0.342917 0.299219 0.248021 0.250757 0.256518 0.286751 0.286286 0.244310 0.257453 0.243064 0.288039
chargesum: 0.00000
title: Mulliken charges with hydrogens summed into heavy atoms:
elementType: S O O O O N N N C C C C C C C C C C C C C C C
charge: 0.938631 -0.494427 -0.528894 -0.205342 -0.214022 -0.216865 -0.112096 0.017859 -0.180107 0.097525 0.448182 0.050049 0.434091 -0.142885 0.023499 -0.042666 -0.231966 -0.027309 0.413644 0.082607 -0.083151 0.066595 -0.092952
polarizability: 2.55972990e+02 -9.56398574e+00 2.56831112e+02 8.75551368e+00 -2.05913327e+01 1.95166849e+02
1716.lowfreq: -7.1489 -2.5392 -0.0010 -0.0002 0.0016 5.4623 14.3945 20.8299 36.0961
frequency: 14.2585 20.7440 36.0704 54.0647 85.1744 96.9469 113.4395 141.7631 164.7453 179.1856 181.0819 191.1640 214.5016 223.4720 240.2270 263.0427 315.5969 361.9304 385.6609 411.9600 420.3138 426.0275 430.0540 466.3269 470.9667 509.7813 519.9991 533.9027 544.7829 547.5934 574.8603 631.8641 633.6118 656.0800 677.5025 705.8011 756.9574 775.6899 782.9172 800.2145 804.3663 809.7545 817.2944 848.3110 905.7323 914.4737 922.9904 931.2731 936.5507 937.6837 956.6856 965.0326 984.4640 991.1527 994.0342 1001.2258 1031.9210 1060.6793 1081.9357 1086.9996 1125.6781 1159.7345 1175.9909 1197.2873 1212.8157 1224.0379 1240.1327 1242.0737 1283.1073 1331.4210 1344.5930 1366.8934 1371.6305 1393.9933 1414.4368 1431.6931 1441.4815 1448.5678 1473.2440 1489.5760 1546.2844 1574.4113 1587.6404 1607.0281 1621.9584 3136.9303 3140.8827 3145.5403 3152.2602 3155.5854 3168.5244 3172.4836 3180.2826 3186.4240 3193.5495 3219.4910
redmass: 7.7979 6.9341 6.2335 12.9737 7.0007 7.2123 7.4477 5.7361 7.3095 7.1829 4.6980 6.4651 7.3962 9.3299 5.9325 6.6108 5.9800 9.6208 8.4540 4.6840 4.6988 5.8258 4.0619 4.0394 4.8635 5.5727 7.2765 6.7769 5.2176 4.8183 6.6343 4.5204 4.7127 7.9762 2.1641 6.0728 10.2703 1.2943 6.2294 2.1578 6.3160 1.4801 7.7688 1.9968 4.0915 1.6944 1.4720 5.8842 1.3702 1.5058 1.4525 6.2076 5.8531 1.3702 1.3636 1.3944 2.7281 2.0852 1.9902 1.4891 1.8396 1.2541 1.1673 1.5259 5.4527 1.9574 2.8178 1.8932 1.5676 1.5084 4.7732 2.1412 10.8784 2.0632 3.4685 3.4609 2.4353 2.6184 2.5365 3.8399 7.1143 6.0338 5.5907 6.8705 7.3123 1.0890 1.0888 1.0927 1.0913 1.0892 1.0919 1.0986 1.0990 1.0927 1.0981 1.0774
irintensity: 3.1703 2.5944 0.8248 0.3671 2.3856 1.7784 5.6926 2.2940 1.3197 2.7640 11.6466 1.9701 1.4825 3.8521 1.8227 0.9869 11.9234 23.1213 6.3330 13.5767 5.2423 30.9909 11.0265 21.5054 58.0068 11.2845 3.3387 3.4066 2.8136 17.0884 4.1966 3.2027 1.5032 6.1384 18.6144 19.7307 35.2831 7.0647 5.0158 60.2857 14.7843 43.1271 53.7233 57.4299 14.4217 6.4848 97.3843 14.1302 7.9190 68.9222 4.1347 41.3059 1.2867 0.0808 1.1980 1.7049 2.4823 5.2920 13.4191 29.0247 2.8339 2.8829 16.3500 2.8976 194.9577 17.4767 88.0360 24.9765 42.6028 20.4915 16.4349 8.2958 95.8974 3.5555 21.5473 2.3167 4.6252 44.3991 53.8202 39.2473 6.0724 4.2151 6.0429 16.1586 5.1881 2.8414 4.6893 9.4098 4.5881 12.9244 2.6310 15.3431 17.1272 1.7233 1.7710 116.9397
temp: 298.150 k
press: 1.00000 atm
elementType: 16 8 8 8 8 7 7 7 6 6 6 6 6 6 6 6 6 6 6 6 6 6 6 1 1 1 1 1 1 1 1 1 1 1
symmnumber: 1
zpe: 620266.7 jmol-1
zpe.correction: 0.236247 hartree
zpe.thermalcorrener: 0.255945 hartree
zpe.thermalcorrenthalpy: 0.256889 hartree
zpe.thermalcorrgfe: 0.185711 hartree
zpe.sumelectzpe: -1439.544869 hartree
zpe.sumelectthermal: -1439.525171 hartree
zpe.sumelectthermalent: -1439.524227 hartree
zpe.sumelectthermalfe: -1439.595404 hartree
dipole: -4.2194 3.9470 2.9684
dipole: 6.4957
quadrupole: -139.6945 -150.5645 -132.0201
quadrupole: -37.2020 -10.9703 -11.6363
quadrupole: 1.0652 -9.8048 8.7396 -37.2020 -10.9703 -11.6363
hfenergy: -1439.7811157 hartree
pointgroup: C01 [X(C15H11N3O4S1)]
dipole: -1.5438783 -1.5451921 -1.3266102 debye
polarizability: 257.9451134|12.0443117|254.9230047|-1.6850474|-20.9333398|195.1028329 unknown
InChI: InChI=1S/C15H11N3O4S/c19-18(20)13-7-2-6-12(10-13)17-23(21,22)14-8-1-4-11-5-3-9-16-15(11)14/h1-10,17H
charge 0 multiplicity 1
34 atoms
S  -1.041358 2.32376 0.288104
O  -2.217474 2.857999 1.2556
O  -0.277257 3.334779 -0.731509
O  4.852843 -2.139375 -0.158242
O  2.875103 -2.77842 0.778503
N  0.271758 1.521462 1.451745
N  -1.832778 -0.545428 1.172078
N  3.679855 -1.879736 0.313841
C  -1.699742 0.894948 -0.796607
C  -2.077157 -0.33526 -0.179093
C  -2.689117 -1.339659 -1.026719
C  -1.848073 1.144287 -2.154616
C  1.50842 1.175091 0.85437
C  -2.857765 -1.075453 -2.424611
C  -2.433311 0.132775 -2.980983
C  -3.093476 -2.565462 -0.404177
C  1.941383 -0.177283 0.820657
C  2.361245 2.198989 0.343697
C  3.225773 -0.465901 0.319795
C  -2.878756 -2.749303 0.962401
C  -2.231746 -1.714759 1.709808
C  3.625391 1.867498 -0.183747
C  4.08323 0.531563 -0.193796
H  -0.285086 0.717663 1.823939
H  -1.517491 2.101403 -2.572124
H  -3.321099 -1.841972 -3.056444
H  -2.554994 0.322624 -4.051702
H  -3.563879 -3.347618 -1.010488
H  1.310808 -0.992334 1.188821
H  2.020732 3.236881 0.377397
H  -3.177219 -3.671699 1.467914
H  -2.026315 -1.851971 2.777051
H  4.269627 2.661678 -0.573702
H  5.068429 0.254732 -0.576465
