program: Gaussian 09
title: 000013841
version: EM64L-G09RevD.01
frameworkgroup: C1[X(C6H15NO6S2)]
method: RPBEPBE
basis: SDD
operation: Freq
keyword: #p
keyword: freq=noraman
keyword: PBEPBE/SDD
title: #p freq=noraman PBEPBE/SDD
converged: YES YES NO NO
title: Mulliken charges:
elementType: S S O O O O O O N C C C C C C H H H H H H H H H H H H H H H
charge: 1.052813 1.052721 -0.415793 -0.415435 -0.526118 -0.502225 -0.501991 -0.526300 -0.318395 -0.351614 -0.351350 -0.263287 -0.263997 -0.730649 -0.730664 0.225497 0.208592 0.208327 0.225485 0.264759 0.228671 0.239988 0.239993 0.228935 0.283421 0.285222 0.292389 0.292445 0.285092 0.283469
chargesum: 0.00000
title: Mulliken charges with hydrogens summed into heavy atoms:
elementType: S S O O O O O O N C C C C C C
charge: 1.052813 1.052721 -0.415793 -0.415435 -0.526118 -0.502225 -0.501991 -0.526300 -0.053636 0.082475 0.082462 0.205372 0.204931 0.130384 0.130341
polarizability: 2.63986799e+02 -2.21943389e-02 1.26994388e+02 -1.54324301e-02 1.54923588e+00 1.22530153e+02
1716.lowfreq: -2.6649 -0.0017 -0.0012 0.0007 5.8072 12.1025 18.1167 19.3506 25.2441
frequency: 15.7176 19.3248 25.1584 25.6252 33.7480 48.1189 58.0738 101.5656 128.9500 143.1341 148.0091 159.8985 163.1803 187.7821 191.0527 217.4193 219.6599 231.6973 262.4984 285.2303 311.0286 338.2617 341.8748 359.3033 387.4104 428.8081 453.1795 509.8040 553.8323 601.0904 602.8241 636.0774 808.3272 819.0604 835.1029 837.2847 912.3218 912.5229 918.3719 921.1268 994.4710 994.4988 997.7977 1031.3521 1037.6707 1042.1583 1062.5911 1072.7390 1145.5671 1167.5482 1179.5792 1226.3958 1271.2139 1285.0197 1302.1249 1316.4701 1316.5416 1332.0025 1359.8236 1386.4422 1415.8635 1415.9079 1417.9618 1418.0269 1464.6223 1471.5061 1471.8538 1482.6767 1492.7381 2916.9490 2922.6671 2970.1888 2970.7780 3040.8330 3041.0702 3041.1459 3044.0693 3075.9561 3077.0964 3189.1844 3189.2799 3198.4646 3198.5583 3477.9080
redmass: 5.7178 7.7505 6.0667 5.4025 6.4706 2.5036 4.1644 1.9260 5.6926 2.8488 2.1328 1.1348 1.3239 3.0661 4.9899 4.1272 4.1823 4.9899 4.8890 6.9229 7.3690 9.6661 8.1470 6.6699 8.1201 5.0740 4.2761 5.5326 7.5588 8.7321 8.8790 1.3136 1.1646 1.3129 9.3394 5.8807 2.8510 2.8484 7.0574 6.0049 1.4567 1.5397 2.1893 2.6963 1.9982 2.3673 1.5410 3.4975 1.6256 2.5107 1.3365 1.3370 1.1301 1.0980 1.1753 1.1334 1.1334 1.2284 1.2703 1.3464 1.0520 1.0520 1.0503 1.0503 1.1792 1.1090 1.0778 1.0920 1.0830 1.0689 1.0698 1.0619 1.0620 1.0879 1.0263 1.0259 1.0891 1.1034 1.1032 1.1077 1.1077 1.1077 1.1077 1.0747
irintensity: 0.4231 0.0049 0.9103 0.2444 1.8465 4.6174 6.3371 11.7774 0.3438 1.7181 4.6140 0.2913 1.4465 0.5243 12.0210 5.8590 5.5202 21.1571 4.9091 3.7362 29.6644 10.7603 7.4457 23.4906 70.2488 45.3578 11.3083 48.6404 18.9215 14.0247 106.5330 92.7187 0.2834 8.8927 23.4659 109.2132 14.2371 50.7206 6.5766 121.0408 53.5770 41.8364 7.3439 7.9469 116.9054 7.6398 134.2906 3.9046 2.6268 214.0843 8.8382 1.6537 2.1192 2.0329 26.8590 3.1162 3.1236 2.3194 23.1116 0.8665 11.3765 15.6117 16.3570 6.8502 35.3592 5.2429 9.0185 4.5920 9.6352 20.7421 114.3233 28.9863 22.8064 0.4882 0.1238 0.1044 27.5547 3.4568 57.2105 0.1198 0.1173 0.0156 0.0146 0.3694
temp: 298.150 k
press: 1.00000 atm
elementType: 16 16 8 8 8 8 8 8 7 6 6 6 6 6 6 1 1 1 1 1 1 1 1 1 1 1 1 1 1 1
symmnumber: 1
zpe: 586653.3 jmol-1
zpe.correction: 0.223444 hartree
zpe.thermalcorrener: 0.244186 hartree
zpe.thermalcorrenthalpy: 0.245130 hartree
zpe.thermalcorrgfe: 0.168655 hartree
zpe.sumelectzpe: -1538.233705 hartree
zpe.sumelectthermal: -1538.212964 hartree
zpe.sumelectthermalent: -1538.212019 hartree
zpe.sumelectthermalfe: -1538.288494 hartree
dipole: -0.0116 7.6717 1.2929
dipole: 7.7799
quadrupole: -98.7756 -107.3692 -116.0134
quadrupole: 0.0352 0.0785 1.0362
quadrupole: 8.6105 0.0169 -8.6274 0.0352 0.0785 1.0362
hfenergy: -1538.4571497 hartree
pointgroup: C01 [X(C6H15N1O6S2)]
dipole: 0.0061596 3.039412 -0.3614417 debye
polarizability: 263.9859032|-0.0023439|127.1341689|0.3571605|-1.3253612|122.3912676 unknown
InChI: InChI=1S/C6H15NO6S2/c1-14(8,9)12-5-3-7-4-6-13-15(2,10)11/h7H,3-6H2,1-2H3
charge 0 multiplicity 1
30 atoms
S  5.181186 -0.348247 -0.066634
S  -5.181168 -0.345563 -0.095039
O  3.605563 0.459339 0.575553
O  -3.609513 0.452631 0.570014
O  4.881712 -0.894677 -1.565747
O  5.829109 -1.336867 1.03558
O  -5.848314 -1.333877 0.99579
O  -4.864505 -0.888983 -1.591806
N  -0.000735 0.016148 -0.2264
C  1.261788 0.729323 0.019307
C  -1.264554 0.727681 0.017562
C  2.377361 -0.307276 0.273454
C  -2.37935 -0.310693 0.268025
C  6.150105 1.280237 -0.117965
C  -6.142122 1.287368 -0.154574
H  1.141437 1.351726 0.924621
H  1.578028 1.405269 -0.807652
H  -1.579955 1.404216 -0.809277
H  -1.146641 1.34911 0.923855
H  0.000203 -0.524918 -1.098508
H  2.536639 -0.928129 -0.633064
H  2.116036 -0.953749 1.128662
H  -2.1189 -0.958593 1.122389
H  -2.535882 -0.929967 -0.6401
H  7.169689 1.017038 -0.431139
H  5.631079 1.920272 -0.842064
H  6.111936 1.682398 0.902734
H  -6.114161 1.687376 0.867317
H  -5.611633 1.926501 -0.871122
H  -7.15914 1.029504 -0.480274
