program: Gaussian 09
title: 000154706
version: EM64L-G09RevD.01
frameworkgroup: C1[X(C16H14N2O2S)]
method: RPBEPBE
basis: SDD
operation: Freq
keyword: #p
keyword: freq=noraman
keyword: PBEPBE/SDD
title: #p freq=noraman PBEPBE/SDD
converged: YES YES NO NO
title: Mulliken charges:
elementType: S O O N N C C C C C C C C C C C C C C C C H H H H H H H H H H H H H H
charge: 0.937929 -0.509512 -0.534417 -0.540427 -0.086921 -0.185419 0.079626 0.449310 0.373709 -0.246087 -0.396832 -0.228895 -0.554644 -0.306335 0.487656 -0.327362 -0.393674 -0.204890 -0.169069 -0.353129 -0.809441 0.325247 0.300247 0.244315 0.247201 0.231364 0.253426 0.276503 0.232206 0.228636 0.240159 0.253885 0.226390 0.237523 0.221720
chargesum: 0.00000
title: Mulliken charges with hydrogens summed into heavy atoms:
elementType: S O O N N C C C C C C C C C C C C C C C C
charge: 0.937929 -0.509512 -0.534417 -0.215180 -0.086921 -0.185419 0.079626 0.449310 0.373709 0.054160 -0.152517 0.018306 -0.323279 -0.052909 0.487656 -0.050859 -0.161468 0.023746 0.071090 -0.099244 -0.123808
polarizability: 2.59682255e+02 -1.08486845e+01 2.32251335e+02 1.08692373e+01 -1.67307568e+01 1.98485807e+02
1716.lowfreq: -9.2853 -7.6842 -0.0014 0.0011 0.0012 5.0635 14.2914 24.5480 28.8911
frequency: 13.8967 24.3911 28.6114 38.1592 83.9908 91.5216 111.8445 140.8563 179.9768 180.6905 184.1692 210.4380 214.2708 223.9554 257.7221 289.2520 326.9813 374.4070 415.7829 422.6938 428.5015 439.4431 467.5703 473.5021 508.1156 520.6537 535.0702 538.1368 550.7265 592.7363 630.3929 634.1768 693.8712 730.6766 774.1144 782.2503 795.9610 800.2658 804.8582 815.3147 847.7180 875.9848 908.2292 917.0200 923.9487 930.1181 935.7213 954.1032 959.0296 982.2729 985.0392 989.0821 999.5528 999.9802 1029.9423 1046.7480 1059.0605 1095.4703 1123.8974 1158.5619 1175.3348 1180.9182 1194.4641 1222.5911 1241.8050 1263.4422 1276.8227 1330.3820 1343.8224 1365.2765 1390.4021 1393.1728 1396.6435 1427.5628 1431.9711 1441.1176 1470.6775 1476.3497 1485.9365 1489.4034 1545.4559 1587.3933 1590.2022 1603.0024 1622.2713 2975.7704 3056.9456 3082.8459 3116.3826 3123.5322 3133.4357 3135.8207 3140.4764 3149.0088 3149.8474 3169.2951 3175.8545 3184.5673 3265.8798
redmass: 3.8679 3.0106 1.2318 5.0952 5.8320 6.8421 5.9085 5.6424 6.7313 4.4864 8.9178 4.1327 4.3219 9.8443 5.9903 3.5956 4.5097 8.1734 4.6444 5.7778 3.8182 3.4080 3.2180 4.2900 5.2059 7.2730 7.0482 5.0495 4.5128 4.9449 7.3800 3.3832 1.9634 5.7739 1.2808 5.9468 1.5046 2.1873 6.4378 7.7639 2.0156 1.3715 1.4313 1.6390 2.6905 6.1448 1.3362 1.4471 6.2574 1.3814 5.5489 1.3718 1.3978 1.5766 2.7218 1.5565 2.0727 1.5573 1.8150 1.2502 1.6110 1.1592 1.5337 1.9547 1.7514 4.3493 1.3247 1.3270 5.0494 2.1138 4.1990 2.0381 1.2838 2.2049 3.3467 2.4832 1.0572 1.2306 2.1275 3.8497 7.2482 5.6373 5.5818 5.9839 7.3674 1.0378 1.0962 1.0996 1.0909 1.0880 1.0887 1.0884 1.0925 1.0943 1.0911 1.0986 1.0990 1.0962 1.0758
irintensity: 1.1810 0.2181 0.3770 0.3851 0.8783 1.0022 4.1329 3.0698 4.0037 5.5646 7.9328 6.1054 1.5158 4.8582 2.4469 8.9558 11.7619 23.0252 18.1243 27.1177 11.5307 29.9878 2.7303 43.9065 2.7836 3.6843 6.4410 3.1931 12.1105 3.8919 2.6571 1.3967 20.7473 2.2795 5.5212 3.2667 53.3104 57.7934 18.2851 52.6431 55.4426 7.5410 12.9788 137.8125 3.2689 8.3668 0.5304 1.6856 40.1111 0.8092 0.0381 0.2685 3.3574 5.6271 1.6379 16.8495 5.6207 13.8312 3.0166 2.7452 1.6814 1.6308 1.9605 14.4892 3.3253 0.1313 24.2071 10.2195 15.0023 12.7643 2.6061 2.9301 10.7320 10.7238 0.5863 4.7084 10.1488 20.4114 21.8130 39.4056 5.0926 5.8172 5.4522 17.0222 5.0384 35.4449 18.9584 16.3792 11.9501 9.2209 3.0731 5.5209 12.4677 29.2895 5.5978 19.9851 21.0860 2.3292 47.2724
temp: 298.150 k
press: 1.00000 atm
elementType: 16 8 8 7 7 6 6 6 6 6 6 6 6 6 6 6 6 6 6 6 6 1 1 1 1 1 1 1 1 1 1 1 1 1 1
symmnumber: 1
zpe: 687000.5 jmol-1
zpe.correction: 0.261665 hartree
zpe.thermalcorrener: 0.280756 hartree
zpe.thermalcorrenthalpy: 0.281700 hartree
zpe.thermalcorrgfe: 0.211587 hartree
zpe.sumelectzpe: -1274.470723 hartree
zpe.sumelectthermal: -1274.451632 hartree
zpe.sumelectthermalent: -1274.450688 hartree
zpe.sumelectthermalfe: -1274.520801 hartree
dipole: -3.3195 8.3250 3.6417
dipole: 9.6740
quadrupole: -110.9954 -134.9819 -125.2340
quadrupole: -8.1565 -3.1744 -11.8024
quadrupole: 12.7417 -11.2448 -1.4969 -8.1565 -3.1744 -11.8024
hfenergy: -1274.7323879 hartree
pointgroup: C01 [X(C16H14N2O2S1)]
dipole: -1.3247232 -3.4395088 -0.9492057 debye
polarizability: 263.1475792|10.0243096|223.6509921|-5.3152035|-20.228013|203.6208252 unknown
InChI: InChI=1S/C16H14N2O2S/c1-12-5-2-8-14(11-12)18-21(19,20)15-9-3-6-13-7-4-10-17-16(13)15/h2-11,18H,1H3
charge 0 multiplicity 1
35 atoms
S  0.023894 2.245916 0.12693
O  -0.951024 3.204627 0.991122
O  1.047129 2.881651 -0.96722
N  1.054021 1.216824 1.424059
N  -1.704874 -0.091619 1.21657
C  -1.044788 1.001746 -0.862596
C  -1.829333 0.038812 -0.160883
C  -2.721829 -0.791317 -0.947334
C  2.074863 0.390322 0.878887
C  -1.062717 1.134217 -2.24452
C  -2.754045 -0.639032 -2.371516
C  -1.931482 0.291769 -3.009154
C  1.992098 -1.030059 0.967808
C  -3.532976 -1.736423 -0.238961
C  3.054961 -1.852309 0.528424
C  3.221054 0.995799 0.29352
C  4.188951 -1.232207 -0.06073
C  4.26263 0.175557 -0.181821
C  -3.428235 -1.831519 1.149604
C  -2.488938 -0.996218 1.834545
C  2.98963 -3.362347 0.686164
H  0.274342 0.689236 1.876202
H  -0.415597 1.877094 -2.723452
H  -3.432622 -1.270308 -2.957104
H  -1.952631 0.39466 -4.098538
H  1.094345 -1.487352 1.404988
H  -4.226629 -2.375794 -0.79686
H  3.275504 2.085348 0.225444
H  5.015879 -1.854975 -0.423135
H  5.144962 0.636359 -0.639394
H  -4.037581 -2.537872 1.720483
H  -2.372628 -1.07471 2.92136
H  3.409273 -3.87888 -0.195735
H  3.571595 -3.694872 1.567498
H  1.951795 -3.712525 0.824644
