program: Gaussian 09
title: 000154700
version: EM64L-G09RevD.01
frameworkgroup: C1[X(C15H10N2O5S)]
method: RPBEPBE
basis: SDD
operation: Freq
keyword: #p
keyword: freq=noraman
keyword: PBEPBE/SDD
title: #p freq=noraman PBEPBE/SDD
converged: YES YES NO NO
title: Mulliken charges:
elementType: S O O O O O N N C C C C C C C C C C C C C C C H H H H H H H H H H
charge: 0.962542 -0.336723 -0.459540 -0.505712 -0.212030 -0.191901 0.009302 0.018848 -0.155119 0.047237 0.442920 -0.223832 -0.394093 -0.234009 0.204613 -0.306718 0.298832 -0.165329 -0.286561 -0.359912 -0.325051 -0.199119 -0.209853 0.306105 0.244580 0.247698 0.251654 0.238146 0.270888 0.254642 0.282235 0.242107 0.243156
chargesum: 0.00000
title: Mulliken charges with hydrogens summed into heavy atoms:
elementType: S O O O O O N N C C C C C C C C C C C C C C C
charge: 0.962542 -0.336723 -0.459540 -0.505712 -0.212030 -0.191901 0.009302 0.018848 -0.155119 0.047237 0.442920 0.082273 -0.149513 0.013689 0.204613 -0.055064 0.298832 0.072817 -0.015673 -0.105271 -0.042816 0.042988 0.033303
polarizability: 3.72986325e+02 8.56117630e+00 2.33772504e+02 -4.99252128e+00 1.64731478e+01 1.60568898e+02
1716.lowfreq: -9.3971 -6.9616 -3.2555 -0.0006 -0.0005 0.0016 14.7426 26.5643 36.0236
frequency: 13.1531 26.5149 35.9709 43.2545 63.2182 84.4859 106.1609 122.0837 138.1521 143.4718 177.8614 195.3384 201.2248 228.7700 243.8849 260.1600 323.0995 348.1302 379.8721 383.1927 415.8878 425.0608 431.7593 437.6132 464.9716 518.7170 526.0984 534.1485 534.9554 549.6794 566.4025 622.1952 628.6767 637.3139 662.7263 746.1505 761.8395 771.1436 782.1740 782.9074 798.0638 804.6975 829.4529 839.3288 843.3441 888.4855 920.3056 932.1932 946.1014 951.1026 971.0760 986.2375 996.7049 997.1931 1026.8701 1029.0778 1062.1443 1064.7839 1117.7573 1127.7542 1158.4477 1168.5468 1191.6468 1194.9800 1220.9915 1228.5542 1242.0605 1249.6737 1347.8718 1355.9917 1364.5637 1374.8364 1388.5877 1433.4140 1434.3780 1439.8798 1442.3315 1488.7733 1536.6942 1557.4922 1587.0321 1588.2236 1623.5401 3134.7156 3136.0083 3140.7384 3145.3226 3161.6425 3162.4331 3174.4938 3175.1875 3177.9159 3184.6416
redmass: 7.6626 6.6776 11.7323 6.2211 7.4937 7.9415 7.2409 6.8957 6.6623 13.6523 4.3671 7.2447 6.1447 10.9267 8.8382 7.0730 9.2448 9.3329 7.8345 6.6436 5.4941 6.0796 6.1935 5.7585 3.1685 7.1642 5.1484 6.6818 6.3064 4.4491 5.3418 3.1916 7.7993 7.3903 4.6423 4.5726 7.5088 1.3420 1.4450 5.8582 1.9326 5.8400 12.3024 6.4029 2.1966 1.4877 6.2721 1.3649 12.5369 1.4795 1.3809 1.3702 1.3976 1.3561 2.6793 2.4724 2.0824 3.3468 1.9414 1.8644 1.2650 1.1857 1.4634 3.6176 5.8974 1.9767 1.7316 1.6112 5.9857 9.0601 2.1093 5.1454 1.9585 2.7113 2.7160 2.8998 2.4623 3.8023 7.5653 6.2436 6.1953 5.7997 7.5316 1.0892 1.0883 1.0924 1.0868 1.0909 1.0916 1.0991 1.0953 1.0980 1.0991
irintensity: 2.8920 3.7371 0.0238 3.3996 1.2633 0.6090 0.5843 0.2347 0.6015 1.5698 4.1766 0.1252 6.6083 1.9048 6.7450 1.7215 5.8186 11.0051 36.8417 10.9822 17.0650 49.4830 73.2309 8.1430 4.2633 3.4395 3.0516 1.4140 4.8077 9.6072 7.0604 0.6129 3.0553 6.8842 14.2304 3.9557 9.8523 13.0254 62.3533 2.0132 58.1317 4.1632 81.5842 23.2653 40.7884 0.4550 4.2673 0.3875 58.1039 2.3795 4.7505 0.4510 1.9669 0.3288 2.6681 1.9439 6.7584 10.6184 1.7015 7.5314 4.4491 11.3698 2.7245 62.8566 115.5911 32.5644 5.9972 13.0366 16.2866 131.4700 13.5122 6.3074 6.9086 3.6047 12.2320 6.8372 56.8880 31.2652 4.7254 14.8628 10.4638 4.9814 5.2989 2.4912 7.1256 12.9024 4.7577 11.4658 9.8234 26.6424 2.5844 14.7391 13.6654
temp: 298.150 k
press: 1.00000 atm
elementType: 16 8 8 8 8 8 7 7 6 6 6 6 6 6 6 6 6 6 6 6 6 6 6 1 1 1 1 1 1 1 1 1 1
symmnumber: 1
zpe: 584152.7 jmol-1
zpe.correction: 0.222492 hartree
zpe.thermalcorrener: 0.242488 hartree
zpe.thermalcorrenthalpy: 0.243432 hartree
zpe.thermalcorrgfe: 0.171214 hartree
zpe.sumelectzpe: -1459.407108 hartree
zpe.sumelectthermal: -1459.387113 hartree
zpe.sumelectthermalent: -1459.386169 hartree
zpe.sumelectthermalfe: -1459.458386 hartree
dipole: 2.7222 0.5781 -2.0084
dipole: 3.4320
quadrupole: -86.1534 -140.2833 -143.9407
quadrupole: 13.8970 -5.8181 14.4283
quadrupole: 37.3057 -16.8242 -20.4816 13.8970 -5.8181 14.4283
hfenergy: -1459.6296004 hartree
pointgroup: C01 [X(C15H10N2O5S1)]
dipole: 1.0400311 0.0016193 -0.8610931 debye
polarizability: 371.2914381|12.1182014|236.9054027|-15.1906288|-10.7370361|159.1308873 unknown
InChI: InChI=1S/C9H6NO2S.C6H4NO3/c11-13(12)8-5-1-3-7-4-2-6-10-9(7)8;8-6-4-2-1-3-5(6)7(9)10/h1-6H;1-4H
charge 0 multiplicity 1
33 atoms
S  0.135689 -0.502596 1.62377
O  -0.885802 -1.305439 0.020829
O  0.610276 -1.739412 2.54764
O  -0.852437 0.607509 2.28319
O  -2.607499 1.963141 -2.012211
O  -0.810895 1.361516 -0.75025
N  2.393944 -1.687113 -0.092204
N  -2.033553 1.206504 -1.131586
C  1.573328 0.417005 0.816074
C  2.542002 -0.324513 0.08127
C  3.649361 0.430964 -0.475989
C  1.612501 1.793111 0.992498
C  3.711656 1.847516 -0.276223
C  2.71523 2.515008 0.439139
C  -2.230791 -1.043202 0.047592
C  4.626471 -0.304577 -1.22316
C  -2.838472 0.122012 -0.534367
C  4.473951 -1.681966 -1.38787
C  -3.099256 -2.034717 0.594396
C  3.33655 -2.33049 -0.804609
C  -4.241936 0.261955 -0.592651
C  -4.496782 -1.886703 0.551353
C  -5.071652 -0.734448 -0.042454
H  0.808585 2.303604 1.530722
H  4.550568 2.407402 -0.706088
H  2.761215 3.599525 0.575893
H  5.480038 0.225922 -1.660106
H  5.200579 -2.272032 -1.953844
H  -2.629178 -2.918669 1.036722
H  3.192885 -3.41013 -0.926269
H  -4.658367 1.154152 -1.068118
H  -5.139972 -2.661966 0.980498
H  -6.158935 -0.613671 -0.074489
