program: Gaussian 09
title: 000154690
version: EM64L-G09RevD.01
frameworkgroup: C1[X(C15H21NS)]
method: RPBEPBE
basis: SDD
operation: Freq
keyword: #p
keyword: freq=noraman
keyword: PBEPBE/SDD
title: #p freq=noraman PBEPBE/SDD
converged: NO NO NO NO
title: Mulliken charges:
elementType: S N C C C C C C C C C C C C C C C H H H H H H H H H H H H H H H H H H H H H
charge: 0.099076 0.249293 -0.388096 -0.364439 -0.372885 -0.389314 -0.366679 -0.565341 -0.376125 0.503844 -0.413328 -0.418005 -0.412957 -0.228787 -0.230213 -0.244150 -0.531598 0.196204 0.199966 0.191727 0.194040 0.196496 0.191227 0.211838 0.210635 0.192802 0.217582 0.205769 0.204237 0.221949 0.208569 0.232647 0.241476 0.231210 0.230235 0.222663 0.222038 0.226395
chargesum: 0.00000
title: Mulliken charges with hydrogens summed into heavy atoms:
elementType: S N C C C C C C C C C C C C C C C
charge: 0.099076 0.249293 0.008073 0.021328 0.014838 0.033159 0.043706 -0.155335 0.054392 0.503844 0.060794 -0.186795 -0.182723 -0.006124 -0.008175 -0.017755 -0.531598
polarizability: 2.07801097e+02 1.47193187e+00 2.03500371e+02 1.96945951e+01 -1.49295780e+01 1.31950749e+02
1716.lowfreq: -18.0341 -2.8351 -0.0013 -0.0012 0.0013 1.0404 4.5260 12.6091 18.7212
frequency: -13.0227 12.1207 17.7109 32.4040 36.4510 38.0231 76.1837 84.8730 87.4887 120.5371 135.4568 143.6814 185.1967 193.5990 276.6848 296.1418 336.0689 382.8431 393.4791 403.1766 403.9216 424.1325 494.6110 517.4642 584.6076 609.6433 617.2587 705.2816 721.4754 733.6442 758.8921 760.8572 808.6936 812.1602 852.5463 858.5828 891.2674 914.7600 948.2092 974.6959 988.2910 989.8735 992.8417 1005.5617 1017.2749 1026.6251 1051.8824 1056.1026 1070.0702 1078.5788 1095.6521 1107.1612 1111.9303 1145.5199 1171.2275 1185.8307 1204.6953 1208.7859 1214.5837 1239.8356 1249.6654 1269.2310 1279.2764 1282.7479 1293.1928 1296.1906 1302.2811 1326.8396 1327.8676 1337.4899 1348.1833 1355.2089 1363.6078 1382.3745 1439.4271 1455.2857 1460.7213 1462.3359 1466.9524 1467.8580 1473.9180 1482.4257 1483.3103 1488.8095 1593.6118 1613.0127 2213.2920 2950.2661 2952.7885 2959.9310 2962.7044 2964.9363 2967.5809 2976.1564 2981.5869 2987.4324 2995.7825 3010.0163 3013.3504 3020.4597 3033.6573 3046.0781 3054.3647 3113.5068 3114.1781 3129.9755 3141.7727 3160.4979
redmass: 4.1684 12.6919 4.3472 4.5897 2.3907 4.5909 2.5488 2.9222 2.9969 2.7507 2.3913 2.2767 2.6105 3.9547 2.9479 3.7762 2.3270 5.3519 12.3391 2.8455 5.7014 3.3523 2.9791 3.2079 4.2619 3.8469 6.3587 1.7282 1.0673 1.1020 1.8544 1.2422 3.7186 1.3415 1.2608 1.6500 1.5804 1.4657 1.9243 1.3892 1.9478 5.5041 1.3345 2.4634 3.5201 2.2029 2.8656 1.5040 2.6874 2.1533 3.3550 1.4836 2.6832 1.9743 1.0522 1.1161 1.2859 1.4243 2.4183 1.2662 1.3420 1.2563 1.1954 1.0602 1.0911 1.1630 1.2409 1.2632 1.3413 1.2920 1.4648 1.6521 1.5343 7.9273 2.1675 1.0802 1.0723 1.0712 1.0910 1.0791 1.1136 1.5351 1.4195 1.1015 6.0608 6.1614 12.2246 1.0588 1.0588 1.0597 1.0577 1.0601 1.0596 1.0592 1.0626 1.0963 1.0984 1.1005 1.1012 1.1022 1.1045 1.1047 1.1040 1.0860 1.0875 1.0909 1.0959 1.1015
irintensity: 0.2402 0.4421 0.4206 0.4345 0.5619 0.5179 1.2901 0.5376 0.3709 1.0249 0.3920 0.0955 2.2991 1.7358 0.7953 0.9592 0.1068 0.8056 0.1493 0.1058 4.3755 0.2986 1.2119 16.2680 6.8971 13.5447 0.0647 53.5081 13.4447 0.1017 39.2828 10.6202 3.2776 3.3536 0.1035 0.7267 3.2457 2.0955 3.7422 0.0197 0.6937 0.0339 0.3891 0.3114 0.0539 7.8036 0.2558 3.9900 0.5952 0.1846 3.3418 7.7368 1.7338 0.5906 0.0821 0.2325 17.3283 9.9596 0.2721 0.8492 0.5464 0.6298 0.3828 0.1303 0.5101 0.1681 1.1167 0.3314 0.6491 34.6810 3.6099 0.0105 18.0590 0.0985 6.5144 2.5777 0.0288 0.1160 0.0875 29.6327 2.7525 8.5276 15.2502 25.5849 1.3853 12.1944 869.1139 3.6899 7.9099 6.8269 44.2886 16.1822 42.4225 99.3907 57.7686 4.2096 1.3074 2.2882 27.8775 4.8405 5.7248 69.2759 151.1229 10.7249 6.0839 12.6626 48.8015 24.3080
temp: 298.150 k
press: 1.00000 atm
elementType: 16 7 6 6 6 6 6 6 6 6 6 6 6 6 6 6 6 1 1 1 1 1 1 1 1 1 1 1 1 1 1 1 1 1 1 1 1 1
symmnumber: 1
zpe: 847310.7 jmol-1
zpe.correction: 0.322724 hartree
zpe.thermalcorrener: 0.340865 hartree
zpe.thermalcorrenthalpy: 0.341809 hartree
zpe.thermalcorrgfe: 0.270790 hartree
zpe.sumelectzpe: -1035.718732 hartree
zpe.sumelectthermal: -1035.700591 hartree
zpe.sumelectthermalent: -1035.699647 hartree
zpe.sumelectthermalfe: -1035.770666 hartree
dipole: 1.1679 -4.3385 0.3284
dipole: 4.5049
quadrupole: -130.0135 -110.3313 -109.4994
quadrupole: 26.4594 1.0074 -4.1125
quadrupole: -13.3988 6.2834 7.1154 26.4594 1.0074 -4.1125
hfenergy: -1036.0414556 hartree
pointgroup: C01[X(C15H21N1S1)]
dipole: -0.3701218 1.5604241 0.754557 debye
polarizability: 206.9395009|9.0680592|183.4343514|-18.7988158|35.4641083|152.8783645 unknown
InChI: InChI=1S/C15H21NS/c17-14-16-13-9-4-2-1-3-6-10-15-11-7-5-8-12-15/h5,7-8,11-12H,1-4,6,9-10,13H2
charge 0 multiplicity 1
38 atoms
S  6.801897 -2.852748 -1.394868
N  6.261106 -0.401893 -0.061607
C  0.842293 0.516958 0.219843
C  -0.446432 1.178945 -0.318193
C  2.114285 1.347417 -0.065599
C  -1.719532 0.354323 -0.025827
C  3.409636 0.661157 0.424522
C  -3.009195 1.016319 -0.579845
C  4.673076 1.499587 0.137296
C  -4.264734 0.211045 -0.272217
C  5.988361 0.828257 0.613777
C  -4.744272 -0.765676 -1.182523
C  -4.960386 0.39147 0.951181
C  -5.886694 -1.542111 -0.880937
C  -6.103239 -0.381476 1.258423
C  -6.570713 -1.352199 0.342087
C  6.49126 -1.438277 -0.630519
H  0.744477 0.35756 1.313681
H  0.952956 -0.489871 -0.233218
H  -0.55422 2.19092 0.126192
H  -0.350234 1.329547 -1.414029
H  2.190756 1.53407 -1.157123
H  2.017404 2.343361 0.415461
H  -1.614984 -0.659553 -0.463089
H  -1.826356 0.208661 1.06846
H  3.335533 0.468228 1.515231
H  3.5037 -0.329134 -0.06407
H  -2.901182 1.142946 -1.675537
H  -3.097541 2.034187 -0.14978
H  4.749449 1.711177 -0.946937
H  4.60259 2.47766 0.654331
H  5.927828 0.632269 1.703963
H  6.839573 1.519944 0.452664
H  -4.221415 -0.91558 -2.135622
H  -4.607042 1.145756 1.665756
H  -6.245265 -2.289069 -1.598623
H  -6.630822 -0.225479 2.206565
H  -7.459123 -1.949697 0.576129
