program: Gaussian 09
title: 000154686
version: EM64L-G09RevD.01
frameworkgroup: C1[X(C12H13N5)]
method: RPBEPBE
basis: SDD
operation: Freq
keyword: #pfreq=noraman
keyword: PBEPBE/SDD
title: #p freq=noraman PBEPBE/SDD
converged: YES YES NO NO
title: Mulliken charges:
elementType: N N N N N C C C C C C C C C C C C H H H H H H H H H H H H H
charge: -0.246439 -0.071886 -0.044883 0.005610 -0.625013 0.220519 0.307406 0.020359 -0.102562 0.097868 -0.527277 0.114391 -0.857868 -0.688139 0.216229 -0.437010 -0.789083 0.275186 0.302803 0.219392 0.219510 0.237950 0.288326 0.238129 0.243128 0.334203 0.345614 0.228306 0.228041 0.247191
chargesum: 0.00000
title: Mulliken charges with hydrogens summed into heavy atoms:
elementType: N N N N N C C C C C C C C C C C C
charge: -0.246439 -0.071886 -0.044883 0.005610 0.054804 0.220519 0.307406 0.020359 -0.102562 0.097868 -0.252091 0.114391 -0.116163 0.076266 0.216229 -0.193882 -0.085545
polarizability: 3.15730392e+02 -4.12785029e+00 1.62364568e+02 6.64668489e-02 -3.61930944e-02 7.80497210e+01
1716.lowfreq: -10.1585 -3.7726 -0.0005 -0.0001 0.0002 5.4723 46.5886 57.1871 65.4633
frequency: 46.0475 57.1186 65.4558 74.9083 112.9842 171.1673 183.5781 183.7239 239.8719 252.7722 259.7272 273.1004 291.2113 339.3544 351.1484 354.0761 390.3208 411.0851 466.4292 488.0713 492.2392 532.6301 533.6129 580.9865 613.3109 617.5153 650.3628 691.6502 714.5959 736.9280 749.9014 807.6773 817.0987 885.3137 900.8772 912.7050 942.5754 987.7572 1019.5565 1039.1580 1039.4938 1045.5099 1064.2381 1081.9222 1121.4235 1151.3308 1203.3587 1218.3002 1261.7153 1275.4881 1303.2040 1330.2741 1345.8691 1384.3594 1389.2674 1404.5512 1412.9526 1423.7430 1465.3296 1466.1323 1470.3031 1473.5285 1476.5625 1481.1491 1486.9261 1507.4018 1532.9771 1556.3492 1588.5146 1625.4893 1656.6170 2965.8565 2966.6885 2979.7618 3034.7448 3041.9134 3056.7957 3095.7760 3111.3706 3116.8850 3158.1561 3187.1870 3575.5779 3722.3038
redmass: 1.3155 1.6725 1.5340 1.9146 3.8482 2.3323 3.6130 4.1883 1.3183 3.5151 3.1221 1.3408 2.9993 3.2873 4.4858 4.5576 5.2586 4.0663 1.6607 2.7291 4.9608 5.2537 3.7092 4.5085 5.4131 3.6579 6.0730 10.0213 5.1757 5.2348 8.0215 3.8340 4.6958 1.5301 2.8762 1.4328 2.2640 1.8940 2.3673 1.5260 3.4495 1.5587 2.8012 2.2629 1.2977 2.1333 2.6828 3.9273 6.2307 2.5706 5.9319 4.1484 3.0019 1.2665 1.3131 2.1125 2.8504 3.4184 1.2125 1.0508 2.2392 2.4695 1.4346 1.0478 1.1772 1.0475 5.2422 2.9123 3.1538 2.8905 4.4020 1.0390 1.0399 1.0379 1.1020 1.0983 1.0972 1.0953 1.0980 1.0918 1.0920 1.0933 1.0452 1.1046
irintensity: 5.6606 1.5192 0.4652 1.3527 4.2182 24.6283 4.1595 1.1640 77.9255 2.8604 1.4850 23.8581 3.2877 5.2080 14.4692 0.1597 20.2424 0.0600 89.3138 67.5875 1.3433 2.6906 0.1232 6.1731 1.5948 2.0787 5.7854 10.2888 3.4184 5.1952 0.8567 4.9197 10.4681 6.2462 17.0722 32.9925 11.1132 25.4742 5.9238 0.4127 5.4447 8.5915 13.3039 45.0628 0.1781 2.8880 2.6626 30.6721 136.2351 7.0260 13.3332 12.5742 50.8651 36.3599 45.6492 35.9539 16.0485 36.7132 5.4977 12.6041 101.7659 32.0193 40.9449 23.8874 30.9746 3.6442 7.9879 299.5128 26.6366 321.4506 313.4095 105.2530 37.1981 31.1419 15.0406 35.3182 20.5362 2.2292 8.9796 34.9487 1.9443 1.7342 178.0173 45.5855
temp: 298.150 k
press: 1.00000 atm
elementType: 7 7 7 7 7 6 6 6 6 6 6 6 6 6 6 6 6 1 1 1 1 1 1 1 1 1 1 1 1 1
symmnumber: 1
zpe: 619043.0 jmol-1
zpe.correction: 0.235781 hartree
zpe.thermalcorrener: 0.251352 hartree
zpe.thermalcorrenthalpy: 0.252296 hartree
zpe.thermalcorrgfe: 0.193032 hartree
zpe.sumelectzpe: -737.646416 hartree
zpe.sumelectthermal: -737.630845 hartree
zpe.sumelectthermalent: -737.629901 hartree
zpe.sumelectthermalfe: -737.689165 hartree
dipole: -4.7320 4.7307 -0.0038
dipole: 6.6911
quadrupole: -61.6785 -103.9462 -102.6448
quadrupole: -7.6776 0.0754 0.0142
quadrupole: 27.7447 -14.5231 -13.2216 -7.6776 0.0754 0.0142
hfenergy: -737.8821969 hartree
pointgroup: C01 [X(C12H13N5)]
dipole: -1.8459676 1.8767542 -0.0143019 debye
polarizability: 315.6407495|-5.434993|162.4297415|-1.4305012|-1.1243097|78.0741895 unknown
InChI: InChI=1S/C12H13N5/c1-6-5-14-8-4-9-11(7(2)10(8)15-6)17(3)12(13)16-9/h4-5H,13H2,1-3H3
charge 0 multiplicity 1
30 atoms
N  -2.597596 0.735691 0.014317
N  -2.581073 -1.575792 0.04363
N  2.393491 1.017545 -0.023423
N  2.349637 -1.847612 0.017559
N  -4.712162 -0.46458 0.043981
C  -1.226111 0.362623 0.009943
C  -0.039382 1.110503 -0.009299
C  -1.254984 -1.096628 0.029581
C  1.179386 0.338212 -0.0061
C  1.15799 -1.123639 0.014673
C  -0.071041 -1.834958 0.03196
C  -3.336266 -0.465511 0.034044
C  0.045087 2.625937 -0.033219
C  -3.214864 2.064354 0.008127
C  3.534002 0.297444 -0.019914
C  3.493751 -1.144787 0.00086
C  4.853705 1.035748 -0.037597
H  -0.069834 -2.926726 0.04657
H  1.108605 2.910141 -0.055315
H  -0.443642 3.057598 -0.927791
H  -0.411198 3.084564 0.865266
H  -3.843135 2.213616 0.907767
H  -2.438495 2.837482 0.009632
H  -3.837114 2.210186 -0.89635
H  4.427928 -1.719762 0.003323
H  -5.26477 0.385827 0.026288
H  -5.175617 -1.368757 0.059738
H  5.460075 0.797197 0.856688
H  5.457436 0.760331 -0.92294
H  4.669589 2.121254 -0.059401
