program: Gaussian 09
title: 000154676
version: EM64L-G09RevD.01
frameworkgroup: C1[X(C20H30O7)]
method: RPBEPBE
basis: SDD
operation: Freq
keyword: #pfreq=noraman
keyword: PBEPBE/SDD
title: #p freq=noraman PBEPBE/SDD
converged: YES YES NO NO
title: Mulliken charges:
elementType: O O O O O O O C C C C C C C C C C C C C C C C C C C C H H H H H H H H H H H H H H H H H H H H H H H H H H H H H H
charge: -0.296322 -0.295486 -0.248702 -0.220276 -0.244229 -0.211219 -0.204698 -0.466238 -0.375687 -0.001777 -0.392811 -0.416088 -0.015682 -0.445107 -0.559763 -0.530874 -0.529408 -0.548946 -0.509726 0.314019 0.246575 -0.516342 0.319614 0.252314 0.241165 -0.780594 -0.779930 0.184531 0.223743 0.196292 0.222187 0.278108 0.237953 0.187513 0.229232 0.201893 0.312561 0.214206 0.221047 0.215366 0.292064 0.252570 0.243269 0.238555 0.266264 0.218580 0.287156 0.257326 0.236692 0.262226 0.256489 0.243601 0.255432 0.242934 0.239757 0.254982 0.243691
chargesum: 0.00000
title: Mulliken charges with hydrogens summed into heavy atoms:
elementType: O O O O O O O C C C C C C C C C C C C C C C C C C C C
charge: -0.296322 -0.295486 -0.248702 -0.220276 -0.244229 -0.211219 -0.204698 -0.057964 0.042792 0.276331 0.032655 0.015037 0.296879 -0.009855 -0.052334 -0.035034 -0.024589 -0.043210 -0.015709 0.314019 0.246575 0.002372 0.319614 0.252314 0.241165 -0.038627 -0.041500
polarizability: 2.55443265e+02 -1.05152785e+01 2.37900875e+02 9.45469122e-01 -1.16286797e+00 1.92401047e+02
1716.lowfreq: -4.0827 0.0004 0.0006 0.0007 4.2407 8.2866 15.9767 25.9347 29.3731
frequency: 15.8640 25.8353 29.2997 37.6568 42.9086 47.3208 50.8161 59.2906 62.9128 72.5231 73.8675 109.6204 110.9973 120.8943 128.9601 130.0266 138.1520 150.1174 171.0500 178.0039 191.7623 203.4156 210.4791 216.0806 233.3956 266.2105 286.5668 293.7074 314.5288 344.5002 346.5921 367.0244 392.8875 400.0087 406.6984 438.9627 441.3792 446.8691 474.1110 489.8765 496.7208 506.0411 518.6962 560.5290 565.9099 605.9926 630.8904 650.2323 666.3960 670.6186 726.9238 738.6839 753.5584 754.5689 775.4720 792.4613 812.2124 824.3445 845.4455 857.7566 876.9622 889.5897 895.5957 919.2532 922.6342 947.6179 952.7123 971.6914 976.3090 984.5812 997.4092 999.4371 1013.8663 1020.9616 1025.9268 1026.6326 1057.9260 1063.3964 1080.8960 1097.2408 1104.1553 1109.7549 1114.7297 1123.0169 1134.6805 1159.8096 1164.7163 1170.4393 1177.6116 1191.8659 1214.8806 1219.9354 1228.6231 1235.1041 1247.4651 1253.4721 1257.6436 1277.8466 1279.2313 1281.9207 1307.3857 1311.8800 1324.6313 1326.4614 1338.7522 1341.8306 1347.7851 1351.7021 1353.9947 1364.1561 1366.1964 1368.0486 1369.0642 1372.8971 1373.3969 1422.0966 1428.1111 1430.6149 1441.0273 1441.8346 1444.2697 1447.1193 1450.4393 1454.0042 1454.3018 1460.5392 1461.5483 1462.0316 1471.2004 1481.3344 1625.6148 1627.3719 1628.8597 1640.4900 1644.5219 2964.9368 2970.3347 2971.5235 2976.4417 2976.8625 2976.9627 2978.4860 2984.6688 2999.9601 3001.8699 3009.5444 3009.6609 3010.0985 3017.3704 3020.1062 3026.3638 3037.8396 3045.0923 3047.0459 3054.0690 3058.5506 3059.2159 3059.3536 3067.6761 3077.0723 3077.3219 3078.0198 3098.4314 3120.6212 3121.0680
redmass: 4.4518 5.0359 6.3383 5.1258 6.0503 6.1567 7.3199 4.8416 5.1027 5.3855 4.9473 3.8985 3.8041 3.1893 1.1238 2.7590 1.1877 3.2085 4.5545 3.1272 4.0016 3.6543 2.9321 3.6558 3.1618 3.2322 3.1272 1.9973 2.8663 3.5656 3.3468 2.8219 2.6285 2.3489 2.2856 2.9844 2.4506 3.2356 3.5948 3.4174 2.9132 2.9940 2.6112 3.4598 4.1344 2.7560 4.1878 2.7158 2.5717 2.7940 2.5202 2.1009 2.8462 2.7008 2.2982 2.8174 3.1146 2.1208 3.2535 2.7278 2.1249 2.0318 2.2503 2.3368 2.1499 2.2818 2.2201 1.8770 2.0788 1.8336 2.1784 3.6954 2.0360 2.3695 2.2054 1.9931 2.1179 2.0551 2.1340 2.4193 2.5567 1.9189 1.5584 2.0613 1.8321 1.4192 1.6472 1.8278 1.5626 1.4184 1.4793 1.4282 1.4147 1.4088 1.3880 1.6980 1.6595 1.2776 1.2518 1.2242 1.3542 1.3266 1.2252 1.4232 1.4749 1.5200 1.4538 1.4033 1.6672 1.4796 1.3399 1.3683 1.3490 1.4859 1.4395 1.0760 1.1056 1.0758 1.0721 1.0710 1.0858 1.0801 1.0889 1.0580 1.0594 1.0866 1.1046 1.1032 1.0769 1.0919 7.6223 7.5892 7.7387 9.7005 10.3612 1.0612 1.0618 1.0641 1.0375 1.0408 1.0588 1.0641 1.0632 1.0614 1.0659 1.0625 1.0597 1.0637 1.0935 1.0899 1.0947 1.0948 1.0990 1.0887 1.1016 1.0954 1.0955 1.0925 1.0989 1.1003 1.0979 1.1023 1.0957 1.1003 1.1002
irintensity: 0.4997 3.6500 2.4535 0.2202 1.3097 3.1167 4.0474 4.0529 1.1134 3.4901 4.2200 0.6604 1.1505 0.5679 0.5375 1.1409 0.9745 3.0670 3.4609 0.5680 2.0550 6.0041 6.4747 4.9569 3.1711 2.2466 1.7657 3.8456 17.1667 11.5908 2.1624 0.8728 7.6862 1.2903 1.9317 4.0595 9.0697 1.9411 3.4561 0.1062 11.2970 7.4422 3.7803 6.2453 8.2005 1.3624 1.2193 0.4217 2.5369 1.7772 0.7862 3.9217 3.3907 10.2552 8.8649 1.7909 7.9540 7.1515 2.1800 3.6021 3.2640 22.4327 8.3774 17.6640 11.0689 10.6236 86.5323 7.0936 23.6257 42.4976 50.4719 10.1276 13.8909 10.9138 19.8326 15.7147 26.7517 5.2921 42.4082 42.3281 3.7990 55.0053 23.4107 212.1963 108.2658 35.3040 19.1296 93.5309 70.1987 49.6385 10.7934 10.0292 24.5608 30.9728 25.6673 68.2220 95.3534 8.0619 4.5519 5.1539 37.7832 8.8110 12.0857 7.5895 3.1858 14.5342 20.8051 0.9659 38.3246 15.8105 68.0570 13.5033 66.1755 3.9033 16.0277 8.0692 49.4462 27.5087 25.3155 25.3169 7.8970 3.3092 37.2529 15.0260 10.1024 15.1293 16.2084 26.2240 1.9427 12.8890 89.9123 26.2630 119.4675 28.0425 281.7438 2.7866 57.3481 30.0675 3.0996 10.0353 24.9107 25.2859 38.9760 18.9652 11.6238 27.0442 11.3920 6.5664 3.8136 10.0145 13.8474 16.6304 56.1318 1.2788 56.7033 11.7495 11.4750 3.8671 15.5888 13.5426 19.7757 8.8588 4.7031 16.2901 15.2961
temp: 298.150 k
press: 1.00000 atm
elementType: 8 8 8 8 8 8 8 6 6 6 6 6 6 6 6 6 6 6 6 6 6 6 6 6 6 6 6 1 1 1 1 1 1 1 1 1 1 1 1 1 1 1 1 1 1 1 1 1 1 1 1 1 1 1 1 1 1
symmnumber: 1
zpe: 1237980.9 jmol-1
zpe.correction: 0.471522 hartree
zpe.thermalcorrener: 0.501275 hartree
zpe.thermalcorrenthalpy: 0.502219 hartree
zpe.thermalcorrgfe: 0.407814 hartree
zpe.sumelectzpe: -1304.599805 hartree
zpe.sumelectthermal: -1304.570052 hartree
zpe.sumelectthermalent: -1304.569108 hartree
zpe.sumelectthermalfe: -1304.663514 hartree
dipole: -1.0381 0.6040 -4.6642
dipole: 4.8163
quadrupole: -149.6221 -154.2632 -171.2198
quadrupole: -33.7574 2.7925 6.3914
quadrupole: 8.7462 4.1052 -12.8514 -33.7574 2.7925 6.3914
hfenergy: -1305.0713273 hartree
pointgroup: C01 [X(C20H30O7)]
dipole: 0.4317572 -0.2136494 -1.8326408 debye
polarizability: 256.961498|-9.0494113|236.397495|-0.7721821|0.8585979|192.3861943 unknown
InChI: InChI=1S/C20H30O7/c1-14(21)12-17-6-4-3-5-7-19(24)27-18(13-15(2)22)10-8-16(23)9-11-20(25)26-17/h17-18H,3-13H2,1-2H3
charge 0 multiplicity 1
57 atoms
O  2.371423 0.59558 0.116345
O  -2.447074 -0.75767 -0.334682
O  -2.11539 -1.814422 1.718001
O  -0.962994 2.697928 0.967716
O  2.625628 1.508802 2.246361
O  5.052154 1.615046 -0.62773
O  -5.309076 -1.676918 -0.470047
C  2.880455 -1.676398 -0.558637
C  1.424421 -2.176307 -0.710675
C  3.10495 -0.635509 0.550466
C  0.870194 -2.901942 0.54082
C  -0.391668 -3.75844 0.264932
C  -3.023894 0.439013 0.355545
C  -2.992628 1.563118 -0.69465
C  4.606832 -0.301047 0.80218
C  -1.561659 -2.985605 -0.389569
C  -1.577242 1.841528 -1.236626
C  -4.436445 0.117294 0.920064
C  0.79269 2.78366 -0.726755
C  -2.054584 -1.834869 0.467277
C  -0.614255 2.453398 -0.21935
C  1.830046 2.93698 0.401653
C  2.285361 1.641121 1.050273
C  5.289995 0.40196 -0.375012
C  -5.40508 -0.472465 -0.109757
C  6.272785 -0.409182 -1.208673
C  -6.494215 0.441467 -0.658629
H  3.53734 -2.542881 -0.338338
H  3.221231 -1.24379 -1.519964
H  1.394162 -2.871986 -1.574715
H  0.776093 -1.318465 -0.973364
H  2.671533 -0.964712 1.513364
H  0.63699 -2.168516 1.336794
H  1.655429 -3.570183 0.95145
H  -0.743067 -4.194542 1.218551
H  -0.125893 -4.602274 -0.402627
H  -2.368371 0.688134 1.208548
H  -3.397572 2.476912 -0.220459
H  -3.650605 1.2935 -1.541971
H  5.121806 -1.248034 1.046214
H  4.658514 0.363972 1.68254
H  -2.424207 -3.666401 -0.534197
H  -1.295938 -2.60106 -1.388402
H  -1.620757 2.519436 -2.114195
H  -1.130186 0.899813 -1.613218
H  -4.840163 1.052879 1.349201
H  -4.306179 -0.616309 1.735525
H  1.117865 2.02599 -1.461243
H  0.716616 3.74309 -1.281484
H  1.440924 3.58527 1.203183
H  2.750912 3.399075 -0.005244
H  5.804039 -1.346092 -1.563884
H  6.631136 0.180526 -2.066602
H  7.13833 -0.704535 -0.583718
H  -6.063737 1.3887 -1.034056
H  -7.053225 -0.062953 -1.46205
H  -7.195352 0.713413 0.154822
