program: Gaussian 09
title: 000154649
version: EM64L-G09RevD.01
frameworkgroup: C1[X(C24H20N4O5)]
method: RPBEPBE
basis: SDD
operation: Freq
keyword: #p
keyword: freq=noraman
keyword: PBEPBE/SDD
title: #p freq=noraman PBEPBE/SDD
converged: YES YES NO NO
title: Mulliken charges:
elementType: O O O O O N N N N C C C C C C C C C C C C C C C C C C C C C C C C H H H H H H H H H H H H H H H H H H H H
charge: -0.256919 -0.220749 -0.211763 -0.199985 -0.192710 -0.256624 0.017240 0.004216 0.020585 0.226462 0.235936 0.204657 0.137592 -0.553746 -0.319146 -0.514350 0.478205 -0.792215 0.393888 -0.395448 -0.347094 -0.497923 -0.385781 0.371698 -0.186713 -0.372435 -0.422780 0.440966 -0.392916 -0.359477 -0.223864 -0.223464 -0.231632 0.254161 0.249344 0.241420 0.332095 0.239993 0.252119 0.251917 0.285208 0.228942 0.318232 0.242380 0.245008 0.293770 0.220387 0.214869 0.233727 0.237937 0.227555 0.227721 0.229502
chargesum: 0.00000
title: Mulliken charges with hydrogens summed into heavy atoms:
elementType: O O O O O N N N N C C C C C C C C C C C C C C C C C C C C C C C C
charge: -0.256919 -0.220749 -0.211763 -0.199985 -0.192710 -0.256624 0.017240 0.004216 0.020585 0.226462 0.235936 0.204657 0.137592 -0.050240 -0.077726 -0.182255 0.478205 -0.048186 0.393888 -0.110240 -0.118152 -0.179691 -0.143401 0.371698 0.058295 -0.078665 0.012476 0.440966 -0.159190 -0.121540 0.003691 0.004257 -0.002129
polarizability: 4.49377668e+02 -3.28756912e+00 3.26824868e+02 -2.92232384e+01 1.89477348e+01 2.56969657e+02
1716.lowfreq: -17.3875 -5.0384 -0.0005 0.0002 0.0005 2.3911 4.1767 6.0766 10.3968
frequency: -16.6518 3.2865 9.6011 13.1944 18.4618 28.8488 43.5628 53.3582 58.0563 69.0071 79.3539 100.3525 125.6368 141.2390 144.4402 153.7075 172.4789 177.2197 181.3131 200.3031 222.0787 226.2498 252.7577 269.7003 297.5850 314.6971 326.4779 339.4560 357.0409 378.7908 393.0563 402.0143 413.9308 423.4089 424.2602 443.6606 478.3706 498.4338 500.0336 506.8970 532.7150 562.3011 580.8240 588.3143 616.6159 620.3674 642.7571 650.0038 657.1431 667.5796 675.2065 701.1919 701.8412 710.5395 735.7455 749.8487 755.1530 764.9157 766.5961 808.8856 818.3485 821.8861 852.5488 853.8352 876.4359 889.9777 902.2070 917.5160 931.4380 933.3837 952.7419 954.9389 963.5839 968.2268 969.1000 977.1207 988.9106 991.0776 997.6026 1001.6844 1017.1030 1025.9182 1026.2279 1040.6182 1054.9773 1080.9422 1088.1821 1088.3786 1094.3210 1140.1848 1172.5380 1176.4441 1181.2339 1185.6230 1186.0476 1200.9894 1210.8308 1218.4792 1221.8419 1225.4445 1253.6648 1279.7802 1310.5574 1321.0995 1323.8396 1335.4215 1351.2484 1359.5114 1370.7038 1376.5825 1386.2649 1403.2267 1407.1152 1417.6073 1431.8727 1436.3285 1439.4304 1457.4349 1467.9835 1470.0658 1474.5625 1480.9778 1481.4992 1486.1683 1487.0237 1526.7851 1582.8020 1593.4740 1596.1703 1597.6497 1616.8360 1618.9726 1621.0047 2973.0060 2996.9506 2999.3729 3043.6714 3047.1088 3060.1179 3064.5904 3107.4200 3122.5814 3125.9970 3126.0968 3137.3726 3147.8335 3149.5118 3160.6164 3165.2184 3173.8883 3188.6648 3188.7475 3198.4199
redmass: 4.0830 6.6090 3.7642 7.2301 9.0673 6.6776 6.4798 12.3950 9.0860 6.0471 6.3113 4.9733 3.0876 7.0031 1.2288 6.0203 6.2785 4.8424 3.6039 4.2354 5.3132 5.2495 5.6407 5.3369 2.6335 3.1323 3.0586 6.6192 5.8131 8.6565 4.5989 2.8129 6.2740 3.1699 6.2744 3.1761 4.0369 5.8103 4.3008 7.1447 5.6398 5.2264 5.0702 4.7068 6.1599 4.6864 6.1268 4.8334 7.4989 5.8657 3.9829 1.8931 2.7769 5.6539 3.6256 8.0964 6.8918 2.4986 4.0149 1.6075 1.5694 3.8024 4.0776 1.2506 3.7780 4.6456 2.2710 1.7926 1.9246 1.4566 3.3409 1.4147 1.4378 1.3555 1.6805 1.3930 6.1965 6.0995 1.3286 1.3589 2.5145 2.3890 2.2593 1.4779 1.9646 1.8857 1.5042 2.0425 2.2924 1.2770 1.0551 1.2801 1.0891 3.0742 1.1318 3.6736 2.5478 5.7722 3.3076 2.5072 1.3164 1.3367 1.5106 1.8360 1.4719 1.6012 1.4865 4.2903 5.9509 10.8487 8.6481 3.9978 1.5463 2.9479 5.3002 2.6294 2.1872 1.1370 3.3233 1.0897 1.9458 2.5414 1.2140 2.1659 2.2113 5.3563 7.8054 6.6469 6.1557 6.8196 6.2124 7.1947 7.4605 1.0410 1.0570 1.0598 1.0966 1.1014 1.1085 1.0883 1.0949 1.0849 1.0880 1.0897 1.0923 1.0904 1.0965 1.0929 1.1017 1.0919 1.0945 1.0964 1.0932
irintensity: 0.2790 1.1079 0.0642 0.3932 0.4177 1.1607 0.6130 0.0828 0.2467 0.1372 0.0263 4.3035 0.2169 0.7095 0.1269 0.0766 0.6963 1.5226 5.2809 1.7688 2.7497 1.5904 2.2724 6.0626 1.7935 1.8642 0.3551 0.3831 1.2535 2.5734 9.1133 0.2510 11.9312 0.5719 2.9602 2.2044 3.8128 4.0466 24.3582 0.3701 0.8210 1.7691 5.4158 6.0500 1.9888 25.2066 17.8619 13.1338 7.2142 0.5388 12.0475 58.2191 24.5005 22.7617 11.7013 10.6362 36.2447 31.3302 5.4372 12.7454 35.6403 8.2513 127.1605 0.7564 91.0772 108.4417 38.3027 130.3742 40.0995 16.9009 85.7631 8.1910 15.5687 1.9676 9.0503 0.0273 1.1703 0.6706 0.0825 0.5569 13.8170 3.8495 14.1154 3.2350 18.5524 27.1856 6.3426 33.1662 6.9903 44.4985 0.0362 5.8512 0.9328 12.5110 2.5095 79.3436 231.8939 309.0821 104.1446 16.1715 10.7311 17.8452 1.8976 1.1397 5.6985 20.4053 99.8995 32.0011 244.1719 127.0987 1.1510 6.4281 2.6819 27.4243 39.0835 25.3267 9.5151 16.0641 18.1876 4.1879 57.3883 41.4868 4.5481 14.4492 28.5457 11.3305 16.6206 7.1235 0.5786 15.4111 0.0544 43.7933 15.8212 34.4568 43.9630 22.4589 12.4555 3.9328 20.5332 17.6949 12.4163 4.2682 0.9865 7.4984 18.2106 11.5387 41.6046 13.6433 26.1932 3.0130 4.1486 4.5352 11.5447
temp: 298.150 k
press: 1.00000 atm
elementType: 8 8 8 8 8 7 7 7 7 6 6 6 6 6 6 6 6 6 6 6 6 6 6 6 6 6 6 6 6 6 6 6 6 1 1 1 1 1 1 1 1 1 1 1 1 1 1 1 1 1 1 1 1
symmnumber: 1
zpe: 1039977.2 jmol-1
zpe.correction: 0.396106 hartree
zpe.thermalcorrener: 0.424431 hartree
zpe.thermalcorrenthalpy: 0.425375 hartree
zpe.thermalcorrgfe: 0.329993 hartree
zpe.sumelectzpe: -1519.164315 hartree
zpe.sumelectthermal: -1519.135991 hartree
zpe.sumelectthermalent: -1519.135047 hartree
zpe.sumelectthermalfe: -1519.230428 hartree
dipole: 5.0465 -6.3714 -8.4957
dipole: 11.7575
quadrupole: -147.6061 -219.1228 -194.0868
quadrupole: 6.6685 -27.5946 -1.2295
quadrupole: 39.3324 -32.1842 -7.1482 6.6685 -27.5946 -1.2295
hfenergy: -1519.5604213 hartree
pointgroup: C01[X(C24H20N4O5)]
dipole: 1.6247247 -3.4519062 -2.6157477 debye
polarizability: 444.9464071|-20.5305121|334.2621598|-33.0307448|1.5408075|253.9636263 unknown
InChI: InChI=1S/C24H20N4O5/c1-17-23(14-25-33-16-18-6-3-2-4-7-18)22-13-21(28(31)32)10-11-24(22)26(17)15-19-8-5-9-20(12-19)27(29)30/h2-14H,15-16H2,1H3
charge 0 multiplicity 1
53 atoms
O  -3.912912 -0.56636 -0.079792
O  0.776222 5.685301 -0.368151
O  -1.272336 4.76459 0.025557
O  5.069436 -2.129857 3.697165
O  3.244925 -0.89947 3.097835
N  1.823622 -0.474428 -1.640452
N  -0.028926 4.672605 -0.315196
N  -2.640664 0.108747 -0.327045
N  4.274032 -1.623618 2.816045
C  1.561652 0.871178 -1.343578
C  0.647654 -1.234637 -1.437244
C  0.180483 0.970585 -0.955183
C  -0.383032 -0.373218 -1.01656
C  3.115286 -1.007451 -2.076453
C  2.417594 1.995007 -1.387085
C  -0.358544 2.227896 -0.610316
C  3.980392 -1.600145 -0.958793
C  0.629874 -2.713601 -1.688003
C  0.506766 3.339562 -0.666762
C  1.876279 3.244043 -1.044118
C  -1.741979 -0.780042 -0.71113
C  3.712891 -1.340207 0.402036
C  5.091787 -2.412364 -1.304319
C  4.564001 -1.896234 1.380488
C  5.933045 -2.95406 -0.307706
C  5.675863 -2.699927 1.055688
C  -4.902751 0.468594 0.351165
C  -6.183659 -0.252952 0.698117
C  -7.252751 -0.312966 -0.229991
C  -6.328534 -0.89033 1.956872
C  -8.448076 -0.994597 0.092808
C  -7.519709 -1.575193 2.281958
C  -8.583339 -1.627697 1.350013
H  3.668592 -0.189452 -2.574815
H  2.943105 -1.777005 -2.851204
H  3.472626 1.911886 -1.666034
H  -1.402758 2.337515 -0.31185
H  0.773169 -2.954147 -2.759925
H  -0.336967 -3.143619 -1.384059
H  1.420884 -3.238553 -1.120171
H  2.482893 4.152608 -1.054701
H  -2.017946 -1.842429 -0.800263
H  2.865771 -0.723563 0.715272
H  5.300999 -2.623842 -2.360414
H  6.785715 -3.578234 -0.59283
H  6.302906 -3.105145 1.85374
H  -4.476483 1.004139 1.219408
H  -5.043155 1.184976 -0.479097
H  -7.147026 0.174633 -1.206734
H  -5.504193 -0.849654 2.678783
H  -9.269787 -1.030925 -0.631071
H  -7.621863 -2.062625 3.257957
H  -9.510171 -2.154917 1.603037
