program: Gaussian 09
title: 000154645
version: EM64L-G09RevD.01
frameworkgroup: C1[X(C22H16FN5O5)]
method: RPBEPBE
basis: SDD
operation: Freq
keyword: #p
keyword: freq=noraman
keyword: PBEPBE/SDD
title: #p freq=noraman PBEPBE/SDD
converged: YES YES NO NO
title: Mulliken charges:
elementType: F O O O O O N N N N N C C C C C C C C C C C C C C C C C C C C C C H H H H H H H H H H H H H H H H
charge: -0.196435 -0.277000 -0.213287 -0.205076 -0.204161 -0.207749 -0.233971 -0.021926 0.020279 0.089420 0.020238 0.310749 -0.604644 0.043903 0.197371 0.514415 -0.319756 -0.480247 0.405734 -0.379942 -0.342280 -0.409384 -0.336069 -0.354958 -0.359369 0.321546 0.417984 -0.368857 -0.515587 -0.373303 0.393116 -0.184023 -0.372452 0.244654 0.259712 0.246439 0.310019 0.288491 0.270683 0.244915 0.252364 0.266902 0.263972 0.239147 0.245596 0.315647 0.243922 0.242889 0.290367
chargesum: 0.00000
title: Mulliken charges with hydrogens summed into heavy atoms:
elementType: F O O O O O N N N N N C C C C C C C C C C C C C C C C C C C C C C
charge: -0.196435 -0.277000 -0.213287 -0.205076 -0.204161 -0.207749 -0.233971 -0.021926 0.020279 0.089420 0.020238 0.310749 -0.100278 0.043903 0.197371 0.514415 -0.073317 -0.170228 0.405734 -0.091451 -0.071597 -0.164468 -0.083705 -0.088056 -0.095397 0.321546 0.417984 0.115886 -0.199940 -0.129382 0.393116 0.058866 -0.082085
polarizability: 5.32451348e+02 3.43482908e+01 2.88240492e+02 4.32493556e+00 -4.74434358e+01 1.93041298e+02
1716.lowfreq: -0.9622 -0.0009 -0.0006 -0.0002 1.0086 6.5217 7.3772 13.3134 17.4759
frequency: 6.5387 13.2526 17.4530 21.7449 28.1817 29.4190 42.7251 57.4994 61.0792 65.1887 81.8943 97.5559 119.8192 148.6720 160.2604 163.5581 174.6932 184.5844 205.6556 212.6428 224.7963 257.1547 286.3167 299.3877 322.0414 327.7608 355.8433 377.3032 392.3781 393.3902 404.9319 412.0337 424.1286 448.7114 453.1087 483.1186 489.9711 492.0867 509.9262 526.6443 555.4898 570.3485 587.8323 622.5428 628.1891 653.3967 660.8003 672.4370 690.9494 698.0516 702.7402 708.3146 726.9539 745.1038 759.2290 762.8447 772.6395 784.6657 811.3752 819.5858 820.7126 824.5180 833.4696 881.7618 898.7280 912.1721 916.3720 930.0501 932.7136 941.3858 949.9336 957.8255 964.0205 971.1054 989.8136 995.3167 999.8586 1006.0932 1016.4207 1022.0005 1054.1876 1085.2506 1090.0052 1102.0937 1110.5148 1147.4296 1158.5984 1176.7798 1178.5111 1194.9430 1201.3950 1207.5768 1208.7165 1211.6548 1226.2296 1237.8749 1251.3444 1280.1089 1283.4207 1300.6478 1332.0079 1337.1003 1347.3692 1362.4295 1370.3642 1372.6325 1393.2475 1403.1638 1406.5702 1413.3248 1434.6466 1439.5781 1467.1612 1475.6831 1481.6798 1483.8560 1498.8488 1501.1702 1563.5410 1591.2084 1592.8915 1604.0338 1615.9278 1619.4812 1623.2221 2985.5698 3003.8988 3042.5730 3051.8500 3088.9430 3129.0913 3131.1081 3143.6787 3150.2348 3161.0950 3177.5658 3180.4553 3188.7549 3188.9172 3195.8826 3201.0071
redmass: 9.8344 8.6008 6.7204 5.3382 5.7991 5.1097 8.0424 10.7537 10.6023 5.4062 7.7970 5.6298 7.7815 5.2333 5.2184 6.2226 7.0253 7.5111 5.5517 3.5182 6.0681 6.9021 7.1561 5.7456 6.1180 3.8486 6.6622 7.5466 4.8718 4.5687 7.7994 2.9567 3.2049 4.5046 4.9135 4.3950 4.0481 6.1776 5.5443 4.9075 6.0819 5.1838 5.7183 6.6072 5.6791 6.5003 7.8360 3.6108 6.8119 4.0303 2.9368 6.3869 5.8296 4.8149 8.5621 4.4768 6.1063 6.5743 1.5054 2.5261 1.7256 1.2632 2.1052 4.3108 4.4428 1.4901 3.8171 1.4627 1.4877 2.0367 2.2723 1.3961 1.3605 1.3281 6.1395 3.0501 1.3537 2.9134 1.9438 3.0820 2.2647 1.7363 1.7773 3.4498 1.3434 1.4910 1.4419 2.0167 1.1440 1.0745 1.7080 7.3732 4.3876 5.2769 3.6864 6.2998 1.3856 1.4019 1.5479 1.3890 1.6017 2.1212 2.2111 3.4667 4.4909 10.9196 4.3474 4.8229 3.3247 2.5800 2.7437 5.9143 1.1246 3.3653 1.3822 2.5591 2.6021 5.8599 6.7689 6.8511 7.9834 7.5186 6.3241 8.1562 6.8331 1.0566 1.0599 1.1061 1.1027 1.0890 1.0908 1.0895 1.0899 1.0907 1.0932 1.0956 1.0958 1.0963 1.0944 1.0935 1.0919
irintensity: 2.5285 0.5210 0.4869 1.3917 1.4574 0.5605 1.4276 0.3287 0.3398 2.4693 0.0167 0.1952 0.1202 5.9007 1.3128 0.5147 0.3295 0.4773 4.1442 5.5930 0.7760 4.0577 1.1434 2.5412 1.5699 3.4913 1.8777 3.3037 2.8420 4.4827 15.9379 0.3838 1.3776 6.0509 3.0752 9.0905 5.4264 3.9621 4.2770 28.2298 11.6696 0.3684 4.9605 6.1285 23.8069 12.9589 13.9925 1.8941 11.1948 19.0769 45.6640 17.7287 17.0526 12.6137 12.6491 0.4697 2.4459 32.3093 40.6118 5.9599 39.9731 3.2554 45.5940 272.1812 34.8062 9.8891 54.3942 51.7368 5.2351 41.2893 70.1677 11.2571 0.2112 2.2337 3.2915 99.8954 0.4873 36.9657 34.8863 126.3261 33.4461 57.4200 4.6533 6.8061 11.8941 31.6443 47.5743 13.5944 14.3004 1.2257 13.9823 394.4942 36.4107 78.3606 155.1898 159.7723 41.3509 22.4892 17.2794 8.0955 22.2036 39.0670 55.7226 10.9716 121.5558 134.8579 0.1758 34.0120 20.5550 3.8915 30.0093 6.6945 58.4660 21.0268 34.6097 30.4663 82.1456 5.3668 32.7133 6.4357 2.6523 10.2724 24.2187 65.2312 9.5299 41.7216 20.7833 14.2519 4.7724 10.8201 8.2516 6.4244 6.5848 8.0747 13.4606 1.2669 1.2757 3.2922 4.8905 8.0424 4.5360
temp: 298.150 k
press: 1.00000 atm
elementType: 9 8 8 8 8 8 7 7 7 7 7 6 6 6 6 6 6 6 6 6 6 6 6 6 6 6 6 6 6 6 6 6 6 1 1 1 1 1 1 1 1 1 1 1 1 1 1 1 1
symmnumber: 1
zpe: 914726.1 jmol-1
zpe.correction: 0.348401 hartree
zpe.thermalcorrener: 0.376628 hartree
zpe.thermalcorrenthalpy: 0.377572 hartree
zpe.thermalcorrgfe: 0.282459 hartree
zpe.sumelectzpe: -1595.138876 hartree
zpe.sumelectthermal: -1595.110650 hartree
zpe.sumelectthermalent: -1595.109705 hartree
zpe.sumelectthermalfe: -1595.204818 hartree
dipole: 3.6560 0.8165 -0.7287
dipole: 3.8163
quadrupole: -253.6232 -193.6691 -184.9096
quadrupole: -57.3031 26.2271 -8.7706
quadrupole: -42.8892 17.0648 25.8244 -57.3031 26.2271 -8.7706
hfenergy: -1595.4872772 hartree
pointgroup: C01 [X(C22H16F1N5O5)]
dipole: 1.3832445 -0.4835256 0.3273069 debye
polarizability: 523.4095695|-55.5283612|303.3375385|4.3771435|-42.488881|186.9860304 unknown
InChI: InChI=1S/C22H16FN5O5/c23-17-6-4-15(5-7-17)13-26-21-9-8-19(28(31)32)11-20(21)25-22(26)12-24-33-14-16-2-1-3-18(10-16)27(29)30/h1-12H,13-14H2
charge 0 multiplicity 1
49 atoms
F  -0.024892 -5.415866 -2.17525
O  2.23103 1.108712 0.151994
O  -8.160409 2.165832 0.184499
O  -6.863588 3.844567 -0.653174
O  7.744247 -1.378949 1.76971
O  5.512747 -1.747403 2.053183
N  -2.277566 -0.154302 0.915466
N  -2.053925 1.926038 -0.054705
N  -7.012064 2.680168 -0.114686
N  0.866018 1.595448 0.053353
N  6.505726 -1.056103 1.601687
C  -3.572492 0.342068 0.757315
C  -1.912575 -1.452508 1.515059
C  -3.412082 1.642667 0.153472
C  -1.394365 0.840652 0.40495
C  -1.395542 -2.482381 0.510734
C  -4.843025 -0.191877 1.071554
C  -4.540703 2.433203 -0.144188
C  -5.796607 1.884801 0.178503
C  -5.963674 0.599355 0.774438
C  0.044358 0.629558 0.415888
C  -0.326582 -3.339298 0.870566
C  -1.994875 -2.619503 -0.766753
C  0.140609 -4.33012 -0.021118
C  -1.540935 -3.600353 -1.673595
C  -0.482197 -4.436031 -1.275809
C  4.562947 1.730225 -0.064143
C  3.13521 2.192626 -0.280976
C  4.856293 0.552744 0.656435
C  5.629364 2.508917 -0.584267
C  6.205892 0.187136 0.843192
C  6.973172 2.124115 -0.380963
C  7.27908 0.950768 0.339331
H  -2.818298 -1.835323 2.020122
H  -1.162496 -1.286037 2.310079
H  -4.969687 -1.179683 1.52536
H  -4.455218 3.421697 -0.60019
H  -6.977676 0.253395 0.988747
H  0.430519 -0.354982 0.716283
H  0.151631 -3.23868 1.852278
H  -2.814009 -1.955165 -1.06309
H  0.968352 -4.995335 0.239665
H  -1.988694 -3.719039 -2.664342
H  2.942262 2.419965 -1.346574
H  2.909829 3.099744 0.312189
H  4.060335 -0.073204 1.063148
H  5.409563 3.421498 -1.151616
H  7.782528 2.737841 -0.788595
H  8.307267 0.623104 0.511535
