program: Gaussian 09
title: 000154614
version: EM64L-G09RevD.01
frameworkgroup: C1[X(C11H8N2O3S)]
method: RPBEPBE
basis: SDD
operation: Freq
keyword: #p
keyword: freq=noraman
keyword: PBEPBE/SDD
title: #p freq=noraman PBEPBE/SDD
converged: YES YES NO NO
title: Mulliken charges:
elementType: S O O O N N C C C C C C C C C C C H H H H H H H H
charge: 0.416874 -0.262733 -0.207023 -0.201947 -0.473446 0.086142 0.406394 0.499674 0.163251 -0.284461 -0.673598 -0.148710 -0.341689 -0.446907 -0.212036 -0.196118 -0.250057 0.275719 0.314145 0.313738 0.308689 0.219931 0.230495 0.230614 0.233059
chargesum: 0.00000
title: Mulliken charges with hydrogens summed into heavy atoms:
elementType: S O O O N N C C C C C C C C C C C
charge: 0.416874 -0.262733 -0.207023 -0.201947 -0.159301 0.086142 0.406394 0.499674 0.163251 -0.008742 -0.359860 -0.148710 -0.033000 -0.226976 0.018459 0.034495 -0.016998
polarizability: 2.93152486e+02 -7.42819379e+00 1.81503686e+02 -9.25902783e-02 -1.26333766e-01 5.90376925e+01
1716.lowfreq: -4.4343 -1.8032 -0.0018 -0.0016 -0.0010 5.4929 17.5570 40.0712 59.4006
frequency: 17.5117 40.0199 59.3917 77.3701 79.2086 139.1587 154.9581 207.9964 211.7998 269.8855 271.1300 332.5800 351.2421 407.4538 426.1802 429.7858 502.4733 503.7478 565.9138 568.0035 614.6613 629.1581 662.6906 676.6845 696.1158 720.8038 722.9515 747.5959 771.9796 827.5642 829.5502 841.4991 844.0000 880.6481 922.5798 930.8345 976.4582 985.1286 1003.9392 1026.3689 1033.5620 1087.0226 1099.4406 1174.3605 1185.8396 1190.8234 1203.6737 1234.0139 1261.7559 1321.9038 1352.1089 1377.6677 1391.1820 1428.2532 1443.7114 1483.8290 1515.9423 1536.1041 1596.3321 1606.3146 1613.9419 3108.6297 3135.8765 3148.2250 3168.1924 3185.8039 3198.8628 3231.9802 3536.7476
redmass: 5.8307 6.3231 7.6454 6.8812 8.9594 6.3168 7.9921 8.7672 5.8432 4.6546 7.7714 10.6061 8.5523 2.9226 5.5693 13.8571 2.7537 8.3077 3.7352 7.0124 6.4825 1.2929 9.9803 8.2758 1.9789 3.4191 7.6369 9.2706 1.7060 1.5297 4.6443 6.1570 1.2701 1.5241 1.4237 6.8652 1.3554 6.1572 1.3091 2.1910 3.3483 1.7181 1.8367 1.0538 1.5327 1.1505 3.3617 4.3832 2.0041 1.4910 11.5473 4.8480 7.5264 2.6512 6.4644 2.4104 2.3742 5.1727 9.4140 3.7229 6.1107 1.0892 1.0868 1.0933 1.0999 1.0954 1.0951 1.0951 1.0758
irintensity: 3.6869 0.0169 1.6510 6.1430 0.0275 3.3654 5.3158 1.6033 0.9430 1.1048 4.7819 3.7721 0.7739 0.0037 0.5086 1.0326 22.7136 1.9513 7.7460 26.5165 1.3175 21.0780 10.8692 12.9338 46.0351 40.8519 14.2279 19.0022 106.3998 17.3080 11.2605 4.3662 0.0575 30.5298 15.6782 0.3068 0.2688 0.0120 3.0836 9.4214 34.0226 8.1111 13.9792 1.4767 20.9608 6.8780 372.6263 114.7255 25.7190 38.4873 108.1401 51.5955 18.9251 60.9414 67.5928 74.4237 253.8305 127.8674 145.9934 26.6223 17.5597 13.9313 0.2470 25.2105 26.1988 1.7175 7.9029 11.8433 8.7738
temp: 298.150 k
press: 1.00000 atm
elementType: 16 8 8 8 7 7 6 6 6 6 6 6 6 6 6 6 6 1 1 1 1 1 1 1 1
symmnumber: 1
zpe: 453259.8 jmol-1
zpe.correction: 0.172638 hartree
zpe.thermalcorrener: 0.187201 hartree
zpe.thermalcorrenthalpy: 0.188145 hartree
zpe.thermalcorrgfe: 0.128391 hartree
zpe.sumelectzpe: -1155.922711 hartree
zpe.sumelectthermal: -1155.908148 hartree
zpe.sumelectthermalent: -1155.907204 hartree
zpe.sumelectthermalfe: -1155.966957 hartree
dipole: -3.4584 -0.0492 -0.0095
dipole: 3.4587
quadrupole: -115.8122 -105.6197 -108.4382
quadrupole: -18.2856 -0.0630 -0.0734
quadrupole: -5.8555 4.3370 1.5185 -18.2856 -0.0630 -0.0734
hfenergy: -1156.0953485 hartree
pointgroup: C01 [X(C11H8N2O3S1)]
dipole: -1.3606815 0.0098533 -0.0115061 debye
dipolederiv: -0.3307068 0.1515721 0.0022997 0.0013871 0.138551 -0.0033861 -0.0038553 -0.0023867 0.2271914 -0.722503 -0.2188348 -0.0106747 0.3396412 -0.9061315 -0.0184983 0.009471 -0.0213926 -0.3500306 -0.4566211 0.0217161 -0.0006793 -0.2252431 -0.9026494 -0.0274075 -0.0101317 -0.025699 -0.2264584 -0.9743932 -0.0504647 -0.0069254 -0.0396183 -0.4421975 -0.0087457 -0.0064403 -0.0087932 -0.2202679 -1.429504 0.4010215 0.0079092 0.7808461 -0.6024907 -0.0063762 0.0206218 -0.0085347 -0.3018622 1.6300812 0.4257706 0.0257037 0.6713156 1.4008888 0.0495173 0.0349557 0.047869 0.2234253 -0.3212992 0.0135374 -0.0014449 -0.2234751 -0.4638112 -0.0187698 -0.0098954 -0.0172569 -0.0083028 1.0986364 -0.2234223 -0.0025161 -0.0727036 0.0560672 -0.0023089 0.0033642 -0.0031242 0.097906 1.6864357 -0.0347548 0.0078367 -0.9211731 1.2735913 0.0317885 -0.022658 0.0363305 0.2490589 0.1835778 0.4367322 0.0185466 0.2127024 0.0517839 0.0064922 0.0093568 0.0077522 -0.0782217 0.3143404 -0.3357269 -0.0094172 -0.019492 0.0416191 0.0097198 0.0031082 0.0073538 -0.2118602 -0.7834808 -0.6649788 -0.0300243 -0.5003779 0.0048835 0.0007974 -0.0236652 -0.0003167 -0.1013075 -0.2687611 0.0141993 -0.0003136 -0.0545954 -0.0565719 0.0029192 -0.0024361 0.003878 -0.1604817 -0.1853481 0.0613586 0.0016193 0.1349553 -0.0127281 0.0061846 0.0036841 0.0061599 -0.2059012 0.0837159 0.06341 0.0026645 0.1613397 0.104644 0.0079155 0.005096 0.0078294 -0.1412941 -0.0148064 0.0053531 0.0004761 -0.1373211 0.1540234 0.0082679 -0.003217 0.0084009 -0.1366846 -0.0135498 -0.0078106 0.0001917 0.0110831 -0.1322829 0.0014039 0.0008404 0.0013413 -0.174602 0.1103559 0.0641102 0.0018287 0.0787317 0.0537224 -0.0048923 0.0026629 -0.0048605 0.1941353 0.1994444 -0.018544 -0.0009718 -0.1150303 0.0989713 -0.0074559 -0.0047432 -0.0067504 0.2969844 0.1326778 -0.0365921 -0.0018472 -0.0041348 0.1284105 -0.0026776 -0.0007858 -0.0026485 0.1968954 0.1893459 0.0399719 0.0014442 0.0133731 0.0506999 -0.0037806 0.0001464 -0.0041021 0.1825769 -0.0270979 -0.1222486 -0.0042832 -0.1042231 -0.0034202 -0.0053681 -0.0040411 -0.005495 0.1679379 -0.0157379 -0.082366 -0.0029696 -0.1172008 -0.0295936 -0.0058716 -0.0039472 -0.0058756 0.1538037 0.045991 0.062664 0.0014747 0.0930668 -0.093158 -0.0071625 0.0023906 -0.0073164 0.1585676 -0.1307931 0.0343265 0.0000721 0.0361465 0.0871786 -0.0023052 0.0001181 -0.0023627 0.1687921 unknown
polarizability: 292.7810753|-9.8229967|181.7185995|0.9453479|4.2832715|59.1941894 unknown
InChI: InChI=1S/C11H8N2O3S/c14-11(12-9-4-2-1-3-5-9)8-6-10(13(15)16)17-7-8/h1-7,12H
charge 0 multiplicity 1
25 atoms
S  3.73172 -1.582894 -0.013571
O  -0.815258 -2.248468 -0.064055
O  3.891293 2.416718 0.140736
O  5.528356 0.805133 0.090185
N  -1.08637 0.087636 0.017671
N  4.290241 1.185312 0.096439
C  1.162756 -0.870832 -0.002909
C  -2.506708 0.222557 0.01552
C  -0.327122 -1.077172 -0.019314
C  1.901789 0.364064 0.049398
C  2.002453 -1.987569 -0.040737
C  3.274082 0.159787 0.050334
C  -3.394049 -0.886303 -0.020604
C  -3.027523 1.544849 0.053222
C  -4.786187 -0.651714 -0.017889
C  -4.419597 1.76007 0.055353
C  -5.3095 0.660815 0.019821
H  1.493709 1.376595 0.085976
H  -0.575963 0.97253 0.050751
H  1.675217 -3.025972 -0.082756
H  -2.989855 -1.89921 -0.050519
H  -2.343581 2.40379 0.080856
H  -5.467119 -1.509582 -0.04564
H  -4.807727 2.78386 0.084602
H  -6.39186 0.8264 0.021432
