program: Gaussian 09
title: 000013775
version: EM64L-G09RevD.01
frameworkgroup: C1[X(C12H8N4O6)]
method: RPBEPBE
basis: SDD
operation: Freq
keyword: #p
keyword: freq=noraman
keyword: PBEPBE/SDD
title: #p freq=noraman PBEPBE/SDD
converged: NO YES NO NO
title: Mulliken charges:
elementType: O O O O O O N N N N C C C C C C C C C C C C H H H H H H H H
charge: -0.175072 -0.255699 -0.202687 -0.198674 -0.191574 -0.199197 -0.481769 0.026572 0.018240 0.021313 0.349575 0.485026 0.224515 -0.302288 -0.498888 0.449611 -0.502365 -0.405404 -0.429856 0.392583 -0.158070 -0.377805 0.357912 0.285114 0.338402 0.325213 0.298458 0.262028 0.249239 0.295545
chargesum: 0.00000
title: Mulliken charges with hydrogens summed into heavy atoms:
elementType: O O O O O O N N N N C C C C C C C C C C C C
charge: -0.175072 -0.255699 -0.202687 -0.198674 -0.191574 -0.199197 -0.123857 0.026572 0.018240 0.021313 0.349575 0.485026 0.224515 -0.017175 -0.160485 0.449611 -0.177152 -0.106946 -0.167828 0.392583 0.091170 -0.082259
polarizability: 3.56065624e+02 1.61553427e+01 2.31132348e+02 -2.24672334e+01 -2.03498511e+00 8.90088135e+01
1716.lowfreq: -6.1273 0.0005 0.0007 0.0008 1.5391 4.4375 24.7714 33.5894 45.4676
frequency: 24.7707 33.5785 45.4650 56.5729 62.2437 77.7545 115.7888 155.9447 162.2871 174.3165 180.2921 219.4201 243.7808 300.0626 315.8821 336.5882 375.2285 383.0308 424.3899 430.4819 440.7366 494.5315 505.0866 514.5809 529.9206 551.1300 616.1906 648.1008 651.7628 661.0367 675.5582 687.1254 704.3780 706.5525 724.9092 751.4015 767.7823 807.7157 819.3658 835.7846 843.9713 880.6079 929.5476 934.1974 948.4301 967.0650 986.8244 997.9339 1004.0761 1051.9947 1086.6510 1089.2540 1106.9613 1148.3963 1161.1731 1178.0954 1205.1365 1211.1201 1233.3270 1252.0349 1288.1942 1310.7696 1346.3363 1365.1998 1379.0576 1381.1175 1399.6840 1440.4003 1449.8471 1479.7194 1491.6872 1534.9271 1582.9977 1601.0092 1613.3149 1627.7614 3146.0076 3168.3996 3176.2991 3185.8792 3187.0479 3193.8793 3195.0297 3196.7569
redmass: 8.0438 8.6436 11.5192 14.9684 9.9536 9.9930 8.8899 7.5968 7.9628 5.3475 7.5114 9.0947 5.6936 6.9836 9.2145 6.9969 11.0914 9.5596 5.7589 3.6200 4.1717 9.0932 7.0908 4.1772 4.9372 6.4233 7.0139 7.0982 6.9464 5.3120 9.4728 3.1109 5.1080 7.1533 5.0435 11.0979 7.7829 2.0815 2.7341 1.2309 1.5342 7.3583 1.6233 2.0686 1.8327 1.4102 5.7039 1.3540 1.3323 2.2467 1.9795 1.5759 3.8828 1.4820 7.6465 1.1435 4.0380 8.5101 3.7329 1.7681 1.3587 2.2896 5.1204 4.9656 11.0687 5.1981 7.8470 4.5177 3.6898 2.8648 3.4283 3.2184 6.5511 3.0066 6.7162 6.8730 1.0896 1.0941 1.0888 1.0926 1.0918 1.0966 1.0962 1.0792
irintensity: 2.4930 1.2994 1.1399 0.2234 0.3820 1.5996 0.9059 2.8767 3.2127 1.8387 1.2474 1.9161 1.8858 2.8266 0.1161 1.1581 0.3834 1.2864 0.6998 1.6052 0.7163 14.8831 2.1886 7.3807 13.8491 5.2557 1.8389 11.3713 11.5579 16.1781 22.4045 17.7928 18.3380 11.7933 8.3742 24.9630 16.1792 16.7148 0.5993 92.1787 76.9006 4.4203 2.5861 10.0776 10.0893 27.5326 0.0910 2.2301 2.7519 14.5846 10.9431 25.4472 62.2431 21.7613 348.0786 12.7969 432.2771 292.7117 129.9996 4.8788 7.3601 65.5359 242.2356 48.8043 118.0584 51.3521 4.1393 11.2509 1.8005 70.8876 278.9932 114.5911 75.1931 212.1365 233.4309 134.8045 5.4433 8.5573 2.1459 2.5303 15.2606 8.7459 8.6290 155.9137
temp: 298.150 k
press: 1.00000 atm
elementType: 8 8 8 8 8 8 7 7 7 7 6 6 6 6 6 6 6 6 6 6 6 6 1 1 1 1 1 1 1 1
symmnumber: 1
zpe: 521390.3 jmol-1
zpe.correction: 0.198587 hartree
zpe.thermalcorrener: 0.216625 hartree
zpe.thermalcorrenthalpy: 0.217570 hartree
zpe.thermalcorrgfe: 0.149971 hartree
zpe.sumelectzpe: -1130.638618 hartree
zpe.sumelectthermal: -1130.620579 hartree
zpe.sumelectthermalent: -1130.619635 hartree
zpe.sumelectthermalfe: -1130.687234 hartree
dipole: 4.9674 3.5925 -3.0171
dipole: 6.8326
quadrupole: -159.3681 -145.7726 -124.6975
quadrupole: 13.8305 -7.1746 -3.2044
quadrupole: -16.0887 -2.4932 18.5819 13.8305 -7.1746 -3.2044
hfenergy: -1130.8372049 hartree
pointgroup: C01 [X(C12H8N4O6)]
dipole: -2.007364 1.2989676 1.2285348 debye
polarizability: 356.7961824|-9.6125203|229.7966464|-25.7217669|3.0487625|89.6139562 unknown
InChI: InChI=1S/C12H8N4O6/c17-14(18)9-3-1-2-8(6-9)13-11-5-4-10(15(19)20)7-12(11)16(21)22/h1-7,13H
charge 0 multiplicity 1
30 atoms
O  3.258476 3.029662 -0.886022
O  1.072074 3.361853 -0.354395
O  4.305816 -2.98514 0.512102
O  5.486148 -1.137348 -0.13547
O  -5.402508 -2.150019 -0.449626
O  -3.284674 -2.700685 -1.093339
N  -0.432037 1.321518 0.236784
N  2.126217 2.582565 -0.476646
N  4.389235 -1.735023 0.191704
N  -4.141587 -1.903459 -0.549097
C  0.723426 0.565262 0.227016
C  -1.781714 0.904019 0.375003
C  1.996659 1.164751 -0.124682
C  0.745903 -0.822296 0.592776
C  3.188772 0.40979 -0.141956
C  3.143286 -0.944198 0.203899
C  -2.270815 -0.317792 -0.148757
C  1.924787 -1.564991 0.58798
C  -2.687227 1.809208 0.997647
C  -3.640206 -0.611459 -0.000698
C  -4.054713 1.490224 1.112792
C  -4.552765 0.264351 0.622249
H  -0.242337 2.3364 0.100182
H  -0.178563 -1.299259 0.923139
H  4.13266 0.88547 -0.42052
H  -1.639895 -1.016698 -0.702217
H  1.933674 -2.617261 0.883934
H  -2.308391 2.75718 1.395133
H  -4.73473 2.197974 1.596266
H  -5.605473 -0.015098 0.706124
