program: Gaussian 09
title: 000154597
version: EM64L-G09RevD.01
frameworkgroup: C1[X(C22H17N5)]
method: RPBEPBE
basis: SDD
operation: Freq
keyword: #pfreq=noraman
keyword: PBEPBE/SDD
title: #p freq=noraman PBEPBE/SDD
converged: NO YES NO NO
title: Mulliken charges:
elementType: N N N N N C C C C C C C C C C C C C C C C C C C C C C H H H H H H H H H H H H H H H H H
charge: -0.230345 -0.044494 0.088911 0.039237 -0.627270 0.353439 -0.083454 -0.046622 0.012246 -0.367804 -0.077984 -0.081242 -0.363393 0.121934 0.355556 -0.663342 0.355926 -0.375854 -0.376381 -0.376776 -0.377376 -0.231248 -0.231236 -0.230965 -0.230936 -0.241123 -0.241031 0.227856 0.260585 0.243041 0.251265 0.242877 0.229887 0.230253 0.230455 0.230811 0.329024 0.346473 0.224160 0.224146 0.224635 0.224612 0.225472 0.226077
chargesum: 0.00000
title: Mulliken charges with hydrogens summed into heavy atoms:
elementType: N N N N N C C C C C C C C C C C C C C C C C C C C C C
charge: -0.230345 -0.044494 0.088911 0.039237 0.048227 0.353439 -0.083454 -0.046622 0.012246 -0.139948 -0.077984 -0.081242 -0.102809 0.121934 0.355556 0.073841 0.355926 -0.145967 -0.146128 -0.146321 -0.146565 -0.007088 -0.007090 -0.006330 -0.006324 -0.015651 -0.014954
polarizability: 4.37986228e+02 5.47482168e-01 2.53525696e+02 -4.12137301e-02 -1.98738567e-01 1.83035968e+02
1716.lowfreq: -73.7020 -53.0434 -33.2373 -0.0005 0.0006 0.0009 2.6677 5.5148 7.1872
frequency: -73.6496 -53.0372 -33.1402 24.1011 45.0508 45.3542 61.9536 88.3800 108.7366 140.1150 160.4062 164.8955 208.0327 209.9573 224.9208 240.6771 270.9760 281.0749 297.4727 315.6476 369.5110 393.9209 395.9620 401.7294 431.9409 437.3189 458.2133 509.2136 521.9937 545.4582 563.9395 564.4382 574.6450 609.8513 611.8699 619.3523 636.8768 655.6739 665.4088 690.8207 692.7236 700.5525 701.6579 712.2822 766.4839 768.8335 775.4723 802.5746 803.7369 841.4248 845.3821 850.4341 851.7901 918.0253 918.3093 930.6906 946.5962 969.8714 972.5081 985.6408 988.7811 990.1268 991.2103 992.8272 1014.9024 1021.0911 1030.5072 1063.3144 1078.1800 1078.3994 1086.9944 1120.0210 1132.1069 1170.6977 1171.3018 1171.6677 1185.9925 1188.3714 1200.5749 1237.7080 1242.6486 1270.7604 1309.8168 1311.2109 1317.1745 1326.4040 1362.2242 1370.0359 1371.5523 1393.7735 1401.8793 1418.7735 1428.3184 1428.8994 1458.5011 1467.3475 1475.2953 1482.3579 1484.2403 1489.3931 1505.9968 1555.2465 1582.3325 1585.6674 1586.1498 1597.1449 1614.5185 1614.8498 1640.6003 2973.1421 3048.5720 3111.7179 3120.1522 3120.8186 3124.9434 3127.1691 3133.7887 3137.0593 3138.7653 3146.9029 3148.3933 3162.6558 3163.2091 3171.9437 3576.8719 3724.9023
redmass: 1.0709 3.8789 3.7089 5.5434 4.3545 5.3782 5.3251 2.9603 5.2980 1.7884 5.1712 5.3201 2.2422 5.9635 4.9601 3.9339 7.0670 3.1826 4.8364 4.5521 5.0623 2.7929 2.7994 4.7016 6.3429 6.7644 1.1799 3.7603 8.3971 5.2076 3.6170 5.0464 7.5219 4.3806 6.4190 6.5824 8.5188 5.1703 4.3433 10.3123 5.7661 1.6366 1.9066 3.8782 2.1379 9.3829 2.3981 1.8384 5.2720 4.7376 1.2657 1.2477 4.2383 1.5509 1.4419 4.4402 1.3253 1.3977 1.3909 3.8703 5.7272 4.4073 1.4435 1.3270 2.7125 2.9072 2.0287 2.4520 1.6007 1.6014 3.2393 1.3098 1.5522 1.9360 1.0528 1.0523 1.1162 1.1166 4.7453 5.3856 5.8827 3.2497 1.3635 1.3657 4.4127 4.7807 5.2773 7.2188 6.6160 3.1155 4.4999 3.0230 2.2056 2.2248 1.7317 4.8888 1.0406 3.1137 1.1517 2.7300 8.3482 2.5865 6.1387 6.0420 6.0445 2.9447 6.2122 5.8561 2.5998 1.0367 1.1023 1.0965 1.0842 1.0842 1.0876 1.0876 1.0891 1.0924 1.0925 1.0969 1.0968 1.1017 1.1018 1.0954 1.0450 1.1048
irintensity: 15.3006 0.0421 0.0436 0.0639 5.9203 0.2496 2.6461 0.5562 1.1306 63.1953 1.4061 0.0450 56.3514 0.3289 0.7647 0.6880 4.4424 1.3925 18.1959 0.8468 15.4638 0.0127 0.0586 0.5087 0.2387 1.2347 148.3464 5.0048 2.9418 1.9330 7.3586 1.4547 5.9764 41.4406 0.0278 0.4261 4.8889 7.9022 5.4188 7.8597 2.6861 90.7063 27.4652 3.8963 12.4547 0.9295 37.8724 38.8563 5.5592 10.1585 0.2583 0.9866 2.6644 4.2175 0.6869 5.5131 0.2383 0.0110 0.1323 24.8774 3.8683 2.4781 0.2139 0.2655 4.3996 52.1928 1.5461 9.4491 6.3266 10.7386 52.7856 0.4040 15.9667 38.3033 0.0005 0.0044 0.6410 2.6194 9.7532 7.4555 13.7270 39.8167 0.3263 1.5588 137.6015 31.0437 56.1013 0.0010 0.0383 22.7231 23.4212 33.3740 0.8615 15.3275 85.3119 5.7022 13.8601 19.4801 12.5799 3.7115 21.8789 191.6206 16.3363 0.9363 1.2619 36.9205 7.1384 18.2234 634.7832 87.9202 25.6588 7.3672 2.6290 2.4264 0.0066 0.8878 13.4211 14.7183 26.3843 2.3899 72.9623 16.3509 43.8870 11.5465 154.5360 42.6170
temp: 298.150 k
press: 1.00000 atm
elementType: 7 7 7 7 7 6 6 6 6 6 6 6 6 6 6 6 6 6 6 6 6 6 6 6 6 6 6 1 1 1 1 1 1 1 1 1 1 1 1 1 1 1 1 1
symmnumber: 1
zpe: 887867.0 jmol-1
zpe.correction: 0.338171 hartree
zpe.thermalcorrener: 0.357999 hartree
zpe.thermalcorrenthalpy: 0.358944 hartree
zpe.thermalcorrgfe: 0.289287 hartree
zpe.sumelectzpe: -1120.476970 hartree
zpe.sumelectthermal: -1120.457141 hartree
zpe.sumelectthermalent: -1120.456197 hartree
zpe.sumelectthermalfe: -1120.525853 hartree
dipole: 6.4757 -0.4113 -0.0001
dipole: 6.4887
quadrupole: -80.3757 -155.7878 -147.4981
quadrupole: -3.3605 -0.0086 -0.0599
quadrupole: 47.5115 -27.9006 -19.6110 -3.3605 -0.0086 -0.0599
hfenergy: -1120.8151403 hartree
pointgroup: C01 [X(C22H17N5)]
dipole: 2.5465854 0.1789485 0.0000535 debye
polarizability: 437.9852407|0.6930691|253.526217|0.0622527|-0.2675969|183.0364343 unknown
InChI: InChI=1S/C22H17N5/c1-27-17-13-12-16-20(21(17)26-22(27)23)25-19(15-10-6-3-7-11-15)18(24-16)14-8-4-2-5-9-14/h2-13H,23H2,1H3
charge 0 multiplicity 1
44 atoms
N  5.157364 0.207786 -0.000027
N  3.581983 -1.473125 0.000159
N  0.575898 -0.886536 -0.000126
N  -0.151824 1.886886 -0.001018
N  5.908123 -2.111095 0.000507
C  3.895363 0.842492 -0.000369
C  2.941141 -0.221985 -0.000239
C  1.545741 0.097368 -0.000418
C  1.182057 1.508414 -0.000871
C  3.542398 2.215707 -0.000868
C  -0.719284 -0.493062 -0.000215
C  -1.090217 0.912263 -0.000678
C  2.181009 2.537413 -0.001102
C  4.89748 -1.174046 0.000168
C  -1.761135 -1.574881 0.000252
C  6.474023 0.842503 0.00066
C  -2.528016 1.34575 -0.000826
C  -2.25497 -2.096248 -1.221179
C  -2.247838 -2.101865 1.222141
C  -3.213412 1.560267 1.220789
C  -3.210433 1.568951 -1.222553
C  -3.222882 -3.125144 -1.221199
C  -3.215801 -3.130712 1.223098
C  -4.559261 1.989098 1.221217
C  -4.556304 1.997716 -1.22322
C  -3.70826 -3.644135 0.001188
C  -5.235698 2.20803 -0.001063
H  4.299472 3.007627 -0.001148
H  1.833801 3.574311 -0.001485
H  7.052503 0.570429 -0.902652
H  6.352342 1.936427 0.004543
H  7.054018 0.564425 0.901155
H  -1.872307 -1.703413 -2.170168
H  -1.859466 -1.71348 2.17064
H  -2.688873 1.399202 2.16963
H  -2.683484 1.414821 -2.171208
H  6.891268 -1.862149 -0.000639
H  5.631127 -3.088645 0.000882
H  -3.594601 -3.52201 -2.172688
H  -3.581994 -3.531923 2.174908
H  -5.077484 2.153281 2.172785
H  -5.072235 2.168618 -2.174852
H  -4.459319 -4.442221 0.001546
H  -6.280116 2.539989 -0.001157
