program: Gaussian 09
title: 000154592
version: EM64L-G09RevD.01
frameworkgroup: C1[X(C13H15N5)]
method: RPBEPBE
basis: SDD
operation: Freq
keyword: #pfreq=noraman
keyword: PBEPBE/SDD
title: #p freq=noraman PBEPBE/SDD
converged: NO YES NO YES
title: Mulliken charges:
elementType: N N N N N C C C C C C C C C C C C C H H H H H H H H H H H H H H H
charge: -0.237137 -0.040816 0.027968 0.005316 -0.630295 0.383340 -0.138440 -0.042063 -0.202845 0.520756 -0.628272 0.114772 0.095161 0.098109 -0.665344 -0.821291 -0.779869 -0.781974 0.230677 0.240887 0.240950 0.252519 0.241567 0.205391 0.241540 0.221254 0.221266 0.260208 0.223224 0.250687 0.223225 0.326760 0.342767
chargesum: 0.00000
title: Mulliken charges with hydrogens summed into heavy atoms:
elementType: N N N N N C C C C C C C C C C C C C
charge: -0.237137 -0.040816 0.027968 0.005316 0.039232 0.383340 -0.138440 -0.042063 -0.202845 0.520756 -0.397595 0.114772 0.095161 0.098109 0.069013 -0.132793 -0.077141 -0.084838
polarizability: 3.01472923e+02 3.50593746e-01 1.96555945e+02 -1.09846847e-02 2.41884511e-03 8.69348824e+01
1716.lowfreq: -96.6157 -15.8823 -0.0004 -0.0002 0.0006 1.3280 6.2834 46.6224 62.8406
frequency: -96.6068 45.0694 62.4144 67.6465 92.0000 102.4973 130.4032 134.7590 147.8171 176.5786 198.1098 232.6420 257.7223 263.7309 279.9759 283.8161 329.9372 342.0392 357.6113 393.4722 442.9388 449.9603 456.9573 478.8727 509.0662 578.4684 590.0710 622.7699 638.4190 656.3709 662.8174 687.3524 735.5686 745.8776 798.3837 819.2439 835.6243 861.2796 954.9828 970.0077 987.6325 1006.5148 1019.4978 1028.0350 1048.7440 1053.5276 1057.6180 1120.1355 1122.1993 1161.8339 1179.4093 1225.5851 1246.5678 1273.6116 1309.9468 1332.5646 1373.0137 1381.0887 1391.7442 1400.8824 1405.5389 1411.5106 1424.9282 1440.4570 1453.0830 1456.9881 1458.1686 1463.7700 1469.2403 1470.0037 1476.6071 1483.9148 1491.7488 1533.3116 1553.1005 1580.7549 1609.2714 1639.8837 2970.8196 2973.7206 2974.1737 2983.6118 3045.3079 3047.0427 3048.1378 3066.3789 3083.7178 3110.7981 3111.1139 3116.1797 3125.5780 3578.9722 3726.8299
redmass: 1.1052 1.4909 1.7146 2.3009 1.6016 3.1348 1.0607 1.0838 4.0280 2.3098 4.5543 2.7705 5.1418 2.7995 2.5507 3.6700 3.7533 4.4011 4.0795 4.4715 5.0405 1.2207 6.1432 4.5483 3.6293 4.5908 5.2650 4.7056 4.6807 4.0195 6.7711 9.5626 5.7374 4.4292 6.2546 4.4868 6.9318 1.4577 2.1480 2.4394 1.8838 1.6720 1.4105 2.0893 1.5538 1.6873 3.0515 1.3087 3.0714 4.0474 2.2460 2.4219 7.0068 4.4848 5.2928 7.0501 5.6416 1.3397 1.2421 1.2520 2.5521 4.5526 3.1473 1.2057 1.0462 1.0485 1.7634 1.7945 1.0467 1.2013 1.0403 1.1494 2.0505 5.5515 2.6421 3.8289 3.5745 2.7262 1.0369 1.0389 1.0379 1.0359 1.1023 1.0967 1.0967 1.0968 1.1007 1.0962 1.0979 1.0976 1.0910 1.0449 1.1048
irintensity: 52.8425 0.3544 0.3216 0.0015 51.0226 9.8719 5.8086 0.7713 5.7255 25.7083 6.4593 0.9409 3.2549 0.7903 2.5344 18.9638 0.3666 0.5845 2.8474 26.6961 1.5440 136.9337 0.0790 0.5194 0.6713 8.8726 2.5043 10.2279 14.1334 1.8728 0.0927 5.3803 0.7148 2.8640 2.1557 6.0673 0.9673 20.3275 39.5673 10.3825 10.7778 11.5008 4.6752 0.1993 9.3878 0.3338 4.6509 0.4638 6.9246 39.6078 30.9196 21.4119 14.4858 34.1741 60.2216 46.7712 56.8203 38.3182 30.6887 13.1911 22.4646 10.4864 9.4195 25.4344 12.0671 0.0007 26.4752 66.6715 34.3404 6.9558 14.0632 14.2684 35.9389 38.0018 148.8577 0.3501 47.9429 597.4998 92.2445 2.7730 56.5414 41.9801 26.5884 39.4153 3.1571 16.1629 21.7545 7.7650 13.7498 7.0760 22.0473 140.3348 41.0591
temp: 298.150 k
press: 1.00000 atm
elementType: 7 7 7 7 7 6 6 6 6 6 6 6 6 6 6 6 6 6 1 1 1 1 1 1 1 1 1 1 1 1 1 1 1
symmnumber: 1
zpe: 687243.2 jmol-1
zpe.correction: 0.261757 hartree
zpe.thermalcorrener: 0.278764 hartree
zpe.thermalcorrenthalpy: 0.279708 hartree
zpe.thermalcorrgfe: 0.217319 hartree
zpe.sumelectzpe: -776.878076 hartree
zpe.sumelectthermal: -776.861070 hartree
zpe.sumelectthermalent: -776.860126 hartree
zpe.sumelectthermalfe: -776.922514 hartree
dipole: -4.9900 1.4844 0.0012
dipole: 5.2061
quadrupole: -61.1474 -104.6610 -108.8311
quadrupole: -3.7301 -0.0065 -0.0016
quadrupole: 30.3991 -13.1144 -17.2846 -3.7301 -0.0065 -0.0016
hfenergy: -777.1398333 hartree
pointgroup: C01 [X(C13H15N5)]
dipole: -1.9579835 -0.6013301 -0.0004787 debye
polarizability: 301.4709194|0.5772042|196.5579489|0.0109629|0.0025159|86.9348824 unknown
InChI: InChI=1S/C13H15N5/c1-6-5-9-11(17-13(14)18(9)4)12-10(6)15-7(2)8(3)16-12/h5H,14H2,1-4H3
charge 0 multiplicity 1
33 atoms
N  -3.103608 -0.167892 -0.000293
N  -1.789319 1.723583 -0.000272
N  1.268172 1.566912 -0.000183
N  2.392156 -1.061625 -0.000107
N  -4.185307 2.016693 -0.000407
C  -1.762152 -0.613166 -0.00027
C  -0.974276 0.574981 -0.000265
C  0.450121 0.451645 -0.000215
C  1.014466 -0.891788 -0.000177
C  0.17974 -2.073474 -0.000212
C  -1.213931 -1.919797 -0.000261
C  -3.046094 1.237571 -0.000356
C  2.605488 1.371357 -0.000121
C  3.177509 0.037398 -0.000072
C  -4.314592 -0.985297 -0.000322
C  0.824472 -3.443844 -0.000242
C  3.483815 2.602402 -0.00012
C  4.674889 -0.175028 0.000026
H  -1.854353 -2.809812 -0.000335
H  -4.928417 -0.795535 0.900886
H  -4.927061 -0.797734 -0.902915
H  -4.036447 -2.050231 0.001245
H  1.477018 -3.575813 0.881418
H  0.061672 -4.242111 0.000145
H  1.476351 -3.576092 -0.882365
H  4.143155 2.6321 0.888655
H  4.142948 2.632217 -0.889047
H  2.844006 3.497968 0.0000
H  5.150697 0.282791 0.888458
H  4.886998 -1.255423 0.000105
H  5.150796 0.282673 -0.888415
H  -5.120662 1.625088 -0.000996
H  -4.05605 3.024181 -0.000371
